{"text_format":"1","workbook":"xlsx","n_sheets":17,"sheets":["Anleitung","VBA-Aktivierung","Parameter","1 JAN","2 FEB","3 MAR","4 APR","5 MAI","6 JUN","7 JUL","8 AUG","9 SEP","10 OKT","11 NOV","12 DEZ","Fortbildung","Summen"],"not_rendered":{"charts":0,"images":14,"macros":1,"external_links":5,"defined_names":150,"comments":15,"pivot_tables":0},"unopened":[],"bounds":{"document_bytes":16777216,"sheet_cells":100000,"rows_first":2000,"rows_last":500,"rows_between":2000,"halvings":0,"cell_chars":16384,"cell_head_chars":4096},"cells_cut":0,"cells_raw":0,"read":"whole","date_system":"1900"}

{"sheet":"Anleitung","index":0,"n_rows":184,"n_cols":4,"rows_kept":184,"cut":false,"hidden":false,"merged":[[177,3,177,10],[178,3,178,10],[166,3,166,10],[167,3,167,10],[118,3,118,10],[142,3,142,10],[143,3,143,10],[144,3,144,10],[156,3,156,10],[157,3,157,10],[164,3,164,10],[146,3,146,10],[165,3,165,10],[127,3,127,10],[137,3,137,10],[161,3,161,10],[169,3,169,10],[133,3,133,10],[136,3,136,10],[174,3,174,10],[175,3,175,10],[176,3,176,10],[168,3,168,10],[135,3,135,10],[54,3,54,10],[50,3,50,10],[39,3,39,10],[51,3,51,10],[45,3,45,10],[170,3,170,10],[171,3,171,10],[172,3,172,10],[173,3,173,10],[60,3,60,10],[59,3,59,10],[72,3,72,10],[83,3,83,10],[110,3,110,10],[106,3,106,9],[99,3,99,8],[58,3,58,10],[81,3,81,10],[63,3,63,10],[71,3,71,10],[159,3,159,10],[160,3,160,10],[67,3,67,10],[68,3,68,10],[19,3,19,10],[20,3,20,10],[21,3,21,10],[25,3,25,10],[52,3,52,9],[22,3,22,10],[34,3,34,10],[53,3,53,10],[36,3,36,10],[33,3,33,10],[43,3,43,10],[40,3,40,10],[42,3,42,10],[49,3,49,10],[37,3,37,10],[48,3,48,10],[46,3,46,10],[47,3,47,10],[17,3,17,10],[18,3,18,10],[56,3,56,10],[191,3,191,10],[185,3,185,10],[186,3,186,10],[187,3,187,10],[188,3,188,10],[190,3,190,10],[189,3,189,10],[183,3,184,10],[115,3,115,10],[116,3,116,10],[126,3,126,10],[180,3,180,10],[119,3,119,10],[125,3,125,10],[120,3,120,10],[121,3,121,10],[122,3,122,10],[123,3,123,10],[182,3,182,8],[140,3,140,10],[179,3,179,10],[8,3,8,10],[80,3,80,10],[10,3,10,10],[11,3,11,10],[27,3,27,10],[9,3,9,10],[55,3,55,10],[24,3,24,10],[78,3,78,10],[32,3,32,10],[41,3,41,10],[62,3,62,10],[13,3,13,10],[61,3,61,10],[26,3,26,9],[29,3,29,10],[30,3,30,10],[31,3,31,10],[44,3,44,10],[57,3,57,10],[76,3,76,10],[14,3,14,10],[15,3,15,10],[16,3,16,10],[70,3,70,10],[69,3,69,10],[158,3,158,10],[73,3,73,10],[74,3,74,10],[77,3,77,10],[138,3,138,10],[75,3,75,10],[85,3,85,10],[84,3,84,10],[82,3,82,10],[114,3,114,10],[128,3,128,10],[111,3,111,10],[112,3,112,10],[91,3,91,10],[104,3,104,9],[107,3,107,9],[113,3,113,10],[103,3,103,9],[124,3,124,10],[117,3,117,10],[109,3,109,10],[134,3,134,10],[6,3,6,9],[93,3,93,10],[105,3,105,9],[86,3,86,10],[90,3,90,10],[95,3,95,9],[163,3,163,10],[129,3,129,10],[130,3,130,10],[131,3,131,10],[149,3,149,10],[150,3,150,10],[151,3,151,10],[152,3,152,10],[153,3,153,10],[154,3,154,10],[145,3,145,10],[147,3,147,10],[148,3,148,10],[139,3,139,10],[38,3,38,10],[64,3,64,10],[65,3,65,10],[66,3,66,10]]}
[false]
[]
[]
[]
[]
[]
[]
[]
[]
[null,null,null,"Willkommen zur Zeiterfassung"]
[null,null,null,"1.) VBA-Code-Aktivierung"]
[null,null,null,"Diese Vorlage hat vielfältigen Programmcode (=Makros), der nur funktoniert, wenn Sie in Ihrem Excel die Sicherheitseinstellungen so gewählt haben, dass das Ausführen von Makro-Code erlaubt wird. \n\nUm zu überprüfen, ob Ihr Excel VBA-Code erlaubt, klicken Sie bitte auf den violetten Button. Wenn danach nichts geschieht, lesen Sie bitte im nachfolgenden Abschnitt 1.a) nach, wie Sie den VBA-Code aktivieren können."]
[]
[null,null,null,"1.a.) Aktivieren der VBA-Sicherheitseinstellungen unter EXCEL 2007, 2010, 2013, 2016, 2019:"]
[null,null,null,"Um in Excel 2007, 2010, 2013, 2016, 2019... Makros zu aktivieren gehen Sie bitte so vor:"]
[null,null,null,"Klicken Sie in Excel 2007 auf den bunten Office-Button oben links bzw. in Excel 2010/2013 auf das Menü Datei und wählen ganz unten den Punkt OPTIONEN."]
[null,null,null,"Dann wählen Sie im sich öffnenden Fenster im linken Bereich in Excel 2007 unten den Punkt VERTRAUENSSTELLUNGSCENTER bzw. in Excel 2010/2013/2016/2019 den Punkt SICHERHEITSCENTER (TRUST CENTER in manchen Versionen genannt)."]
[null,null,null,"Anschließend können Sie im selben Fenster in Excel 2007 rechts auf die Schaltfläche EINSTELLUNGEN FÜR DAS VERTRAUENSCENTER bzw. in Excel 2010/2013/2016/2019 auf SICHERHEITSCENTER (Trustcenter Settings) klicken."]
[null,null,null,"Im nächsten Fenster wählen Sie links in der Mitte den Punkt EINSTELLUNGEN FÜR MAKROS. Nun gibt es folgende zwei Auswahlmöglichkeiten:"]
[null,null,null,"I) Möchten Sie bei jedem Öffnen der Zeiterfassung gefragt werden, ob Sie den Makrocode erlauben wollen, klicken Sie im rechten Fensterteil auf den Punkt ALLE MAKROS MIT BENACHRICHTIGUNG DEAKTIVIEREN. "]
[null,null,null,"II) Wenn Sie keine fremden Exceltabellen mit VBA-Code erhalten oder ein Antivirenprogramm haben, können Sie die Sicherheitseinstellungen auch auf ALLE MAKROS AKTIVIEREN stellen - dann müssen Sie nicht bei jedem Öffnen der Vorlage auf AKTIVIEREN klicken."]
[null,null,null,"Tipp: Wenn Sie für diese Schritte hier eine detaillierte Anleitung mit Bildern wünschen, laden Sie sich bitte unter nachfolgendem Link eine Anleitung dazu von uns herunter und lesen bitte für Excel 2007 den Abschnitt 1.3 oder für Excel 2010, 2013, 2016 oder 2019 den Abschnitt 1.4 (die Seiten 8 bis 11) durch:"]
[null,null,null,"http://www.simplesoft.at/Buchhaltung/UPDATES/Installation_Sicherheitseinstellungen.pdf"]
[]
[null,null,null,"b.) Grundsätze für das Ausfüllen:"]
[null,null,null,"Grundregel zum Ausfüllen der Vorlage: In allen Tabellen sollten nur die weißen Zellen ausgefüllt werden. "]
[null,null,null,"\n\nBei zahlreichen Zellen gibt es in der rechten oberen Ecke ein rotes Dreieck, wie etwa hier:\nDies bedeutet, dass bei diesen Zellen ein Kommentar (Ausfüllhinweis) hinterlegt ist. Dieser Kommentar wird sichtbar, wenn Sie mit der Maus über diese Zelle fahren."]
[null,null,null,"Mit den Lupensymbolen kann das betreffende Tabellenblatt größer und kleiner gemacht werden.\nAlternativ können Sie bei gedrückter STRG-Taste auch das Mausrad drehen."]
[]
[null,null,null,"c.) Vorstellung und Bestellung des Tools"]
[null,null,null,"Wenn Sie nähere Informationen zu dieser Zeiterfassung hier wünschen, besuchen Sie bitte unsere Homepage www.simplesoft.at und gehen in den Bereich EXCEL-TOOLS / ZEITERFASSUNG oder klicken auf nachfolgenden Link:"]
[null,null,null,"http://www.simplesoft.at/Excel-Tools/ZEITERFASSUNG_Excel/zeiterfassung_excel.html"]
[null,null,null,"2.) Speichertort und einmalige Einstellung "]
[null,null,null,"Mit dieser Vorlage können für einen Mitarbeiter die Arbeitsstunden und bei Bedarf auch die Urlaube und die Fortbildung erfasst werden. Möchte man dies für mehrere MitarbeiterInnen erfassen, legt man Kopien dieser Vorlage für jede/n Mitarbeiter/in an."]
[null,null,null,"Wir empfehlen für jedes Jahr einen eigenen Datei-Unterordner anzulegen, um die Übersichtlichkeit zu erhöhen. Am besten ist Sie legen irgendwo einen Hauptordner z.B. mit dem Namen ZEITERFASSUNG an; (wenn Sie ein Netzlaufwerk haben, dann werden Sie vermutlich dieses wählen, damit von allen PCs auf die Stundenlisten zugegriffen werden kann). In diesen Hauptordner ZEITERFASSUNG legen Sie für das erste Jahr einen Unterordner an. Zum Beispiel:"]
[null,null,null,{"$f":"YEAR(NOW())","v":2020}]
[null,null,null,{"$f":"\"Danach erstellen Sie für jeden Mitarbeiter eine Kopie von dieser Vorlage hier im ersten Jahresordner \" & YEAR(NOW()) & \" und geben der Datei den Namen des Mitarbeiters. Z.B.: Müller.xlsm\"","v":"Danach erstellen Sie für jeden Mitarbeiter eine Kopie von dieser Vorlage hier im ersten Jahresordner 2020 und geben der Datei den Namen des Mitarbeiters. Z.B.: Müller.xlsm"}]
[null,null,null,"Tipp: wenn Sie zwei verschiedene Arten von MitarbeiterInnen haben - z.B. normale MitarbeiterInnen und zusätzlich Studenten - oder normale Angestellte und freie Dienstnehmer, so können Sie gerne dafür auch eigene Unterordner machen. Legen Sie zuerst im Hauptordner ZEITERFASSUNG einen Unterordner mit der Jahreszahl an und darin legen Sie dann die beiden Unterordner an, denen Sie z.B. die Namen MITARBEITER und STUDENTEN geben. "]
[null,null,null,{"$f":"\"In diesem Fall lautet der Pfad zu den Stundenlisten zB: C:\\ZEITERFASSUNG\\\" & YEAR(NOW()) & \"\\Mitarbeiter\\ und C:\\ZEITERFASSUNG\\\" & YEAR(NOW()) & \"\\Studenten\\\"","v":"In diesem Fall lautet der Pfad zu den Stundenlisten zB: C:\\ZEITERFASSUNG\\2020\\Mitarbeiter\\ und C:\\ZEITERFASSUNG\\2020\\Studenten\\"}]
[null,null,null,{"$f":"\"Wichtig: bitte geben Sie die Jahreszahl beim Jahresordner 4-stellig ein - also z.B. \" & YEAR(NOW()) & \" und nicht nur  \" & YEAR(NOW())-2000 & \"  - Grund: das Jahr 2020 ist dann besser zu erkennen.\"","v":"Wichtig: bitte geben Sie die Jahreszahl beim Jahresordner 4-stellig ein - also z.B. 2020 und nicht nur  20  - Grund: das Jahr 2020 ist dann besser zu erkennen."}]
[null,null,null,"a.) Erstanlage eines neuen Mitarbeiters\n\nUm die Stundenliste für einen neuen Mitarbeiter anzulegen, gehen Sie bitte immer wie folgt vor:\n\n1) Öffnen Sie die allgemeine Zeiterfassungs-Vorlage und speichern sie Sie mit der Excel-Funktion SPEICHERN UNTER in den entsprechenden Unterordner für das aktuelle Jahr."]
[null,null,null,"2) Gehen Sie dann  in die Tabelle PARAMETER und klicken oben auf den blauen Button ERSTANLAGE NEUE/R MITARBEITER/IN. \nDer Assistent führt Sie durch alle benötigten Fragen und stellt alle Paramter richtig für Sie ein.\nSie werden unter anderem nach den SOLL-Stunden eines jeden Tages gefragt. Diese ist die reine Arbeitszeit OHNE Mittagspause ! Bitte achten Sie unbedingt darauf, dass die hier in der Zeiterfassung hinterlegten SOLL-Stunden in Summe genau den Wochenstunden entsprechen, mit denen die/der MitarbeiterIn bei der Krankenkasse angemeldet ist. Fragen Sie sicherheitshalber bitte bei der Lohnverrechnung nach, wenn Sie sich über die angemeldete Wochenstundenanzahl eines Mitarbeiters nicht sicher sind."]
[null,null,null,"3) Sie haben die Möglichkeit Mittagspausen automatisch verbuchen zu lassen. Angenommen ein Mitarbeiter arbeitet montags von 9 bis 17 h und macht dabei zu Mittag ene halbe Stunde Mittagspause. Sie können bei diesem Mitarbeiter am Montag einen Mittagspausen-Vorschlag von zB. 12:00-12:30 hinterlegen. Wenn sich der Mitarbeiter dann abends abmeldet, schlägt ihm das System eine automatische Mittagspausenverbuchung vor und wenn er - auf Wunsch aktivierbar - die Frage ob er die Pause gemacht hat, mit JA beantwortet, bucht das System die Mittagspause automatisch. \n\nDie Zeitdauer der Mittagspause kann in der PARAMETER-Tabelle in den Zellen E6-F12 für jeden Wochentag einzeln eingestellt werden."]
[null,null,null,"Wenn dieser Mitarbeiter am Freitag nie eine Mittagspause macht, kann man bei ihm am Freitag eine \"leere\" Mittagspause von 12:00 bis 12:00 hinterlegen und es wird dann vom System zwar ein Vormittagszeitblock von zB 9:00-12:00 und ein Nachmittagsblock von zB 12:00 bis 14:00 gebucht, aber dadurch erfolgt natürlich kein Mittagspausenabzug. Zudem haben Sie die Möglichkeit in der PARAMETER-Tabelle in der Zelle G18 aktivieren, dass es an Tagen, an denen der Mitarbeiter zB. weniger als 6 h arbeitet, nie ein Mittagspausen-Vorschlag gemacht werden soll."]
[null,null,null,"Alternativ dazu können Sie die Mittagspausenautomatik vollständig deaktivieren (ein Häkchen setzen in der Tabelle PARAMETER im Feld K18) und dann kann sich der Mitarbeiter bis zu zweimal am Tag AN und ABMELDEN und seine Mittagspause selber variabel buchen: zB. meldet er sich um 8:30 AN, dann meldet er sich am Beginn seiner Mittagspause um 12:30 AB. Am Ende seiner Mittagspause meldet er sich zB. um 13:15 wieder AN und abends um zB. 17:15 meldet er sich wieder AB."]
[null,null,null,"Wenn Sie mit dem automatischen Mittagspausenabzug arbeiten, kontrollieren Sie bitte in der Tabelle PARAMETER In den Zellen E6 bis F12  für jeden Tag die Mittagspausen-Zeiten. An Tagen (etwa Freitag), wo der Mitarbeiter keine Mittagspause macht, geben Sie bitte ein Mittagspausen-Zeitfenster mit der Dauer von 0 Minuten ein: zB von 12:00 bis 12:00. \n\nSonderfall Nachmittagsarbeit: Beginnt bei einem Mitarbeiter die Arbeitszeit zB erst um 12h und geht bis zB. 19h, dann werden Sie die Mittagspause zB. von 16:00 bis 16:30 eintragen. "]
[null,null,null,"Noch ein paar weitere Beispiele für die Anlage der Stundenliste für einen Mitarbeiter:\n\nBsp 1 : der Mitarbeiter arbeitet montags von 8:00-12:00, hat dann eine unbezahlte halbe Stunde Mittagspause und arbeitet erneut\nvon 12:30-17:00. Geben Sie auf die Frage des Anlageassistenten nach den Sollstunden für den Montag 8,5 ein. Nach der Mitarbeiteranlage tragen Sie in der Tabelle PARAMETER in der Zelle E6 und F6 die Mittagspause für den Montag von 12:00 bis 12:30 ein."]
[null,null,null,"Bsp 2 ganz unregelmäßige Zeiten: wenn es nur eine durchschnittliche Soll-Wochenstundenanzahl gibt und der Mitarbeiter sehr unregelmäßig arbeitet (zB nur jeden zweiten Freitag usw), verteilt man die Stunden einfach irgendwie auf die Wochentage, sodass in Summe genau die Soll-Wochenstundenanzahl erreicht wird, mit der der Mitarbeiter bei der Gebietskrankenkasse angemeldet ist. Arbeitet er z.B. jeden zweiten Freitag 6 h, tragen Sie freitags bei ihm 3 h ein. Dann hat er an einem Freitag, an dem er 6 h arbeitet 3 Plusstunden und am nachfolgenden Freitag, an dem er nicht arbeitet, 3 Minusstunden, was sich in Summe aufhebt."]
[null,null,null,"Bsp 3 : Arbeitet eine Person auf Werkvertragsbasis ohne jegliche Soll-Wochenstundenanzahl, erfasst man als Normalarbeitszeit bei der Erstanlage mit dem Anlageassistent an jedem Tag nur NULL Stunden, da es ja keine Soll-Zeit gibt. Der Mitarbeiter bucht dann täglich die gearbeiteten Stunden, wobei der Automatismus für die automatische Mittagspausenverbuchung genutzt werden kann. Da es bei Werkverträgen keine Soll-Arbeitszeit gibt und in der Regel immer alle gearbeiteten Stunden auch ausgezahlt werden, macht es keinen Sinn den monatlichen Stundenendsaldo in das nächste Monat vorzutragen, da es in diesem Fall keine Minus- und Plusstunden gibt. Die gearbeiteten Stunden des aktuellen Monats finden Sie jeweils in der Zelle I45. "]
[null,null,null,"Wenn Sie Mitarbeiter mit Werkvertrag haben, aktivieren Sie in der Tabelle PARAMETER in der Zelle K34, dass Sie bei Mitarbeiteranlagen gefragt werden wollen, ob es sich um einen Werkvertrag handelt oder nicht. Sie werden dann bei jeder Neuanlage gefragt, ob Sie den Monatsendsaldo in das Folgemonat vortragen wollen; bei fix angestellten Mitarbeitern macht dies natürlich Sinn, bei Werkvertrags-Mitarbeitern werden Sie den Saldovortrag ablehnen. Sie können nach der Anlage eines neuen Mitarbeiters in der Tabelle PARAMETER in der Zelle G34 auch manuell bei Werkvertrags-Mitarbeitern den Saldovortrag ins Folgemonat deaktivieren."]
[null,null,null,"Wenn die Mitarbeiter die Mittagspause bezahlt bekommen, haben Sie zwei Möglichkeiten:\n1.) Sie erfassen keine Mittagspause und der Mitarbeiter meldet sich nur an und am Ende der Arbeitszeit wieder ab. Er macht zwar Mittagspause, aber da diese als Arbeitszeit gilt, wird Sie nicht extra ausgewiesen.\n2.) Wenn Sie die Mittagspause ausweisen wollen (was im Falle der Kontrolle durch das Arbeitsinspektorar auch Sinn macht), müssen Sie das \"Zeitgeschenk der bezahlten Mittagspause\" in Form von reduzierten Soll-Arbeitszeiten abbilden. Schenken Sie einem Mitarbeiter von Mo-Do jeden Tag eine halbe Stunde Mittagspause, muss die Sollzeit von zB 8,5h an diesen Tagen auf 8h reduziert werden. Achtung: in diesem Fall wird auch die angezeigte wöchentliche Sollzeit von zB 40h auf 38 h reduziert."]
[]
[null,null,null,"Wichtig: die Tabelle PARAMETER ist mit demselben allgemeinen Passwort geschützt wie auch die Monatstabellen. \nUm die Parametertabelle zu öffnen, klicken Sie in der Tabelle bitte einmal oben links auf den grünen ZU-Button. Sobald Sie den roten AUF-Button sehen, ist die Tabelle PARAMETER für das Bearbeiten der Einstellungen geöffnet. Anfangs ist der Tabellenblattschutz in der PARAMETER-Tabelle immer deaktiviert. Wenn Sie nach der Einrichtung der Stundenliste das Ändern der Einstellungern für User, die das Passwort nicht kennen, verhindern wollen, klicken Sie auf den roten AUF-Button, um die Tabelle abzuschlließen."]
[null,null,null,"b.) E-Mailadresse der Lohnverrechnung:  \n\n  - Möchte man die Stundenliste monatlich an die lohnverrechnende Stelle automatisch vermailen lassen, so gibt man in\n     der Tabelle PARAMETER einmal die E-Mail-Adresse ein mittels der Taste Email ändern:"]
[null,null,null,"Danach kann man monatlich die ausgefüllte Stundenliste an die Lohnverrechnung mailen mit dem E-Mail-Symbol:\nDie Voraussetzung dafür ist ein installiertes Microsoft Outlook. \n(Wenn Sie das Chef-Cockpit verwenden, können Sie auch die Stundenlisten aller Mitarbeiter auf einmal versenden. Wenn Sie sich für die Premium-Version der Zeiterfassung entschließen, erhalten Sie das Chef-Cockpit kostenlos dazu."]
[null,null,null,"c.) Einstellen des aktuellen Jahres:\n\nIn der Tabelle 1 JAN kann über die beiden Schaltflächen in der Zelle J6 das aktuelle Jahr eingestellt werden.\n\nDies machen Sie aber bitte immer nur in der allgemeinen und leeren Stundenlisten-Vorlage. Bei bereits befüllten Stundenlisten wechseln Sie bitte das Jahr immer mit dem Button JAHRESWECHSEL in der Tabelle 1 JAN ganz oben."]
[null,null,null,"d.) Einstellung von Automatismen:\n\nWenn Sie in der Tabelle PARAMETER in Zelle F4 die automatische Mittagspausen-Verbuchung aktivieren, können Sie in Zelle E18 einstellen, dass bei Arbeitszeiten, die weniger als z.B. 6 Stunden dauern, keine Mittagspause verbucht wird. \n\nPrinzipiell wird bei aktivierter Mittagspausen-Verbuchung immer dann beim Abmelden eine Mittagspause verbucht, wenn der Beginn der Arbeitszeit am betreffenden Tag VOR dem Beginn der in der Tabelle PARAMETER hinterlegten Mittagspause liegt und der Abmeldezeitpunkt an diesem Tag NACH dem Ende der dort hinterlegten Mittagspause ist. Mittels des Parameters in Zelle G18 können Sie die automatische Mittagspausenverbuchung noch zusätzlich beschränken, dass sie nur erfolgt, wenn die Tagesarbeitszeit mehr als die dort hinterlegte Stundenanzahl ist - z.B. 6 Stunden. "]
[null,null,null,"Wichtig: durch die Mittagspausenverbuchung wird die tatsächliche Arbeitszeit am betreffenden Tag natürlich um die Mittagspause gekürzt. Angenommen Sie wollen die Mittagspausenverbuchungen erst bei mehr als 6h Arbeitszeit und ein Mitarbeiter hat an einem Tag zB 6h und 15 min gearbeitet. Das System erkennt, dass die Grenze von 6h überschritten ist und schlägt eine Mittagspause vor. Wenn Sie den Vorschlag mit JA beantworten, macht die Software einen Mittagspausenabzug und es bleiben als gearbeitete Arbeitszeit an diesem Tag 5h und 45 min. Dies zur Erklärung, falls der Mitarbeiter nach der Mittagspausenverbuchung wissen möchte, warum am betreffenden Tag weniger als 6 h Arbeitszeit waren und die Software eine Mittagspause verbucht hat. Die Antwort: ohne Mittagspausenverbuchung wäre die Arbeitszeit mit den 6h und 15 min ÜBER dem Schwellenwert von 6h gewesen und mit der Mittagspause sank der Wert auf 5h 45 min."]
[null,null,null,"Wenn Sie die Zelle G18 leer lassen, gibt es keine Grenze unterhalb der keine automatische Mittagspause vorgeschlagen wird. In der Zelle K18 können Sie die Berücksichtigung von hinterlegten Mittagspausen komplett deaktivieren für Mitarbeiter mit sehr unregelmäßigen Pausen. Der Mitarbeiter muss sich dann manuell bei jeder Mittagspause AB- und wieder AN-melden."]
[null,null,null,"In Zelle G21 können Sie aktivieren, dass vereinfachte Zeitangaben automatisch in das Excel-Zeitformat umgewandelt werden: dann wird aus der Eingabe 7 automtaisch 7:00 und aus 730 wird 7:30. Dies gilt sowohl für die Stunden, die der Mitarbeiter manuell in den Spalten V-AA erfassen kann, als auch wenn die Person, die das Passwort für das direkte Arbeiten in den Zeiterfassugsspalten E-H hat, manuell Korrekturen vornimmt in diesen Spalten.\n\nIn Zelle D26 können Sie einstellen, dass nach dem AN- und AB-Melden die Zeiterfassungs-Datei automatisch gespeichert wird - wenn Ihre Mitarbeiter die Stundenliste den ganzen Tag offen haben, kann damit bei Stromausfällen verhindert werden, dass Excel die Information verliert. In Zelle F26 können Sie zudem aktivieren, dass sich die Vorlage nach dem automatischen Speichern auch automatisch schließt."]
[null,null,null,"In Zelle G29 werden Sie die automatische Stundenkalkulation in der Regel nicht aktivieren. Wenn kein Häkchen gesetzt ist - was die Standardeinstellung ist - dann werden an Tagen, wo keine Zeiten erfasst sind, auch keine Stunden automatisch als IST-Stunden kalkuliert. \n\nWann kann es dennoch Sinn machen, diesen Parameter mit einem Häkchen zu aktivieren: wenn eine ohnedies sehr konstante Anwesenheit der Mitarbeiter auf anderem Weg kontrolliert werden kann und die Mitarbeiter üblicherweise KEINE Zeiten zu erfassen haben und nur an Tagen, wo sie ausnahmsweise später kommen oder früher gehen, die tatsächliche Zeit erfassen und alle übrigen Tagen automatisch als voll gearbeitet gelten sollen."]
[null,null,null,"e.) Mitarbeiterdaten:\n\nÄndert sich der Name eines Mitarbeiters, können Sie dies jederzeit  in der Tabelle 1 JAN in Zelle E9 und - bei Bedarf - die MitarbeiterInnennummer in E8 eintragen. Der Name und die Mitarbeiternummer wird in allen anderen Tabellen automatisch übernommen."]
[null,null,null,"f.) Wegzeit:\nWegzeit sind jene 1-2 Minuten die vom Betreten des Arbeitsplatzes bis zum Starten des PCs und der Anmelden in der Zeiterfassung vergehen. Ein Dienstgeber kann in der PARAMETER-Tabelle freiwillig in der Zelle F24 ein oder zwei Minuten Wegzeit eingeben. Diese wird beim Anmelden des Mitarbeiters automatisch gutgeschrieben, indem sein Anmeldezeitpunkt um 1 bzw 2 Minuten vorgezogen wird."]
[null,null,null,"2b.) Einstellung für den Monatsabschluss"]
[null,null,null,"In jeder Monatstabelle gibt es unten links den violetten MONATSABSCHLUSS-Button. In der PARAMETER-Tabelle können Sie dafür ab der Zeile 44 die gewünschten Einstellungen treffen:"]
[null,null,null,"In der Zelle I44 können Sie einstellen, dass der Monatsabschluss nur nach Eingabe des Administrator-Passwortes möglich ist (das Sie beim Erwerb der Vollversion von uns erhalten.)"]
[null,null,null,"In der Zelle E46 können Sie einstellen, ob die vom Mitarbeiter in der betreffenden Monatstabelle manuell erfassten Zeiten (etwa, wenn er vergessen hat sich an- oder abzumelden und die entsprechende Zeit manuell in den Spalten X-AA erfasst) automatisch oder jeweils einzeln mit Rückfrage als gültige Arbeitszeit in die Zeitspalten E-H übernommen werden sollen."]
[null,null,null,"In der Zeile 47 stellen Sie ein, ob bei einem Monatsabschluss eventuelle Zeitguthaben automatisch zur Auszahlung reserviert werden sollen. Dadurch wird das Zeitguthaben im betreffenden Monat ganz unten in der Zelle R48 eingetragen und vor dem Übertrag ins nächste Monat abgezogen. Sie können zudem einstellen, ob diese Zeitguthaben jeden Monat, quartalsweise, halbjährig oder nur einmal am Jahresende ausbezahlt werden sollen."]
[null,null,null,"Zudem können Sie einstellen, ob immer die Zeitguthaben immer zur GÄNZE zur Auszahlung reserviert werden sollen, oder ob Sie jedes Mal gefragt werden wollen, wieviel Sie vom Zeitguthaben auszahlen lassen wollen, sodass ein Teil als Zeitguthaben ins Folgemonat vorgetragen werden und dort als Zeitausgleich konsumiert werden kann."]
[null,null,null,"Alternativ können Sie diesen Vorschlag auch gänzlich deaktivieren und eine Plusstundenauszahlung nur im Bedarfsfall im gewünschten Monat manuell in der Zelle R48 erfassen."]
[null,null,null,"In der Zeile 48 in der PARAMETER-Tabelle können Sie einstellen, dass der Monatsabschluss automatisch im betreffenden Monat in der Spalte B beim letzten Tag ein OK setzt. Dadurch wird das Monat bis zu diesem Tag gesperrt und es können nachträglich keine Änderungen vom Mitarbeiter mehr erfasst werden (kein Urlaub und Krankenstand und auch keine manuellen Zeiten)."]
[null,null,null,"Wenn Sie die PREMIUM-Version der Zeiterfassung erwerben, können Sie die Gutstunden nach verschiedenen Bewertungsmethoden als Mehr- oder Überstunden mit variablen Zuschlägen bewerten lassen. Laden Sie sich gerne unter nachfolgendem Link die Theorie zu Mehrstunden und Überstunden herunter. Kollektivvertragliche Besonderheiten besprechen Sie bitte direkt mit der Lohnverrechnung, die Ihnen bei der korrekten Hinterlegung der Überstunden-Zuschläge auch behilflich ist."]
[null,null,null,"http://www.simplesoft.at/Theorie_Mehrstunden_und_Uberstunden.pdf"]
[null,null,null,"Mehr-/Überstunden und Zuschläge können, nach einer erstmaligen Hinterlegung der Prozentsätze, von der Software automatisch mit dem Monatsabschluss berechnet werden. "]
[null,null,null,"In den Zeilen 50-62 können Sie insgesamt 7 verschiedene Automatismen für die Mehrstunden-/Überstundenermittlung aktivieren. Lesen Sie dazu bitte die entsprechenden Infos direkt in den Kommentaren in der Tabelle PARAMETER - erkennbar an den roten Dreiecken im oberen rechten Eck in allen Zellen, in denen ein Kommentar erfasst ist. Im Kommentar der Zelle D49 werden die 7 Automatismen kurz erklärt."]
[null,null,null,"Für Mitarbeiter, die sich nicht an-/abmelden können oder sollen (etwa weil sie keinen PC-Zugang haben oder extern arbeiten), gibt es die Möglichkeit beim Monatsabschluss deren Zeitbuchungen automatisch machen zu lassen, wobei dann immer die SOLL-Stunden als IST-Stunden eingetragen werden. Aktivieren Sie diesen Automatismus in der Tabelle PARAMETER in der Zeile 81 und tragen Sie die gewünschten Zeitbuchungen in den Zeilen 84 bis 90 ein."]
[null,null,null,"3.) Täglicher Vorgang des Mitarbeiters"]
[null,null,null,"a.) Die An- und Abmeldung in der Zeiterfassung erfolgt mit den beiden Schaltflächen AN und AB in den 12 Monatstabellen. Dabei trägt das System automatisch die AN- und AB-Meldezeitpunkte in die Zeitspalten E bis H. Ausgehend von diesen Spalten E bis H wird die tatsächliche, tägliche Arbeitzeit (auch IST-Stunden genannt) ermittelt, welche in der Spalte I angezeigt wird. \n\nDurch den Vergleich mit der SOLL-Arbeitszeit in der Spalte J (die durch das Wochenmodell gesteuert wird, das bei der Erstanlage abgefragt wird) ergibt sich an jedem Tag Gutstunden oder Minusstunden, die in den Spalten R und S angezeigt werden."]
[null,null,null,"b.) Korrekturen: hat der Mitarbeiter vergessen sich anzumelden oder war es wegen eines Auswärtstermins wie Fortbildung nicht möglich sich an- und/oder abzumelden, erfasst der Mitarbeit die Arbeitszeit manuell in den Spalten W-AA. Der Personalverantwortliche, der die Arbeitszeit kontrolliert, wird diese manuelle Erfassung überprüfen und kann sie in die Spalten E-H übernehmen. Diese nachträgliche Übernahme der manuellen Zeit muss natürlich nicht manuell gemacht werden, sondern geht in jeder geöffneten Monatstabelle entweder mit dem ROTEN KREUZ-Button oben links oder auch direkt beim Monatsabschluss unten mit dem violetten Button, der unter anderem auch die manuellen Zeiten tageweise mit Frage oder vollautomatisch übernehmen kann. "]
[]
[null,null,null,"c.) Feiertage: Die Vorlage hat die österreichischen unbeweglichen Feiertage ohnedies bereits in der Spalte U in den einzelnen Monatstabellen mit einem F markiert. Bewegliche Feiertage (Ostern / Pfingsten / Fronleichnam / Christi Himmelfahrt) werden von der Vorlage mit einem B ausgewiesen und jedes Jahr automatisch eingetragen. Durch die Markierungen B und F erkennt die Vorlage, dass es an diesem Tag keine Soll-Arbeitsstunden gibt. Sollte es für Sie einen weiteren arbeitsfreien Feiertag geben, so können Sie fixe Feiertage mit einem F eintragen; zusätzliche bewegliche Feiertage (bei evangelischen Mitarbeitern etwa der Karfreitag) müssen jährlich mit einem B am betreffenden Datum manuell eingetragen werden in der Spalte U."]
[null,null,null,"d.) Urlaub / Krankenstand: An Tagen, wo man auf Urlaub oder im Krankenstand ist, kann man natürlich keine Stunden erfassen. Sowohl Urlaubstage als auch Krankenstands-Tage dürfen natürlich nicht zu Minusstunden führen, weshalb in der Berechnung des Monats-Stundensaldos diese Tage mit vollen Stunden eingehen wie normal gearbeitete Tage. Für diese beiden Sonderfälle brauchen Sie nur in der Spalte T ein K für Krank oder U für Urlaub machen. \n\nFür folgende Sonderfälle der Abwesenheit tragen die Mitarbeiter bitte in der Spalte T die folgenden Kürzel ein und beschreiben den  Abwesenheitsgrund in der Spalte W: P für Pflegeurlaub / B für Begräbnis / A für Amtswege und Arztbesuche / und S für Sonderurlaub wie Übersiedelung etc."]
[null,null,null,"Stundenweise Urlaube sind prinzipiell in dieser Vorlage nicht vorgesehen, da sie arbeitsrechtlich nicht gerne gesehen werden. Es gibt aber einen Trick um dennoch Urlaub nur stundenweise zu verbrauchen: der Mitarbeiter trägt an dem Tag, wo er Urlaub nimmt sowohl in der Spalte T und AUSNAHMSWEISE auch in der Spalte U einen Urlaubstag ein, indem er jeweils ein U dort einträgt. Da er an diesem Tag nur ein paar Urlaubsstunden verbraucht und dennoch arbeitet, wird er sich prinzipiell wie gewohnt AN und AB-Melden, aber eben ein paar Stunden kürzer arbeiten. Da an diesem Tag durch den auch in der Spalte U eingetragenen Urlaubstag keine SOLL-Stunden in der Vorlage vorhanden sind, sind die gearbeiteten Stunden automatisch MEHRSTUNDEN, die den Zeitsaldo erhöhen und die der Mitarbeiter zu einem späteren Zeitpunkt als Zeitausgleich verbrauchen kann. So verbrauchte der Mitarbeiter zwar offiziell an diesem Tag, den er als Urlaubstag eingetragen hat, einen ganzen Urlaubstag - aber da er zum Teil auch arbeitete und so Mehrstunden entstehen, kann er die \"nicht konsumierten Urlaubsstunden\" von diesem eingetragenen Urlaubstag zu einem späteren Zeitpunkt als Zeitausgleich verbrauchen."]
[null,null,null,"e.) Teilweise Abwesenheit: Eine weitere Besonderheit ist gegeben, wenn der Mitarbeiter einen Teil des Arbeitstages an der Arbeitsstätte und einen Teil außerhalb verbringen. Mögliche Gründe können zB ein beginnender Krankenstand im Laufe des Tages sein, ein Arztbesuch, ein Amtsweg, eine externe Fortbildung usw. "]
[null,null,null,"In all diesen Fällen haben die Mitarbeiter meist keine Möglichkeit sich entweder morgens richtig anzumelden oder abends richtig abzumelden. Da in der Regel jedoch auch die nicht an der Arbeitsstätte vebrachten Stunden als Arbeitszeit gelten, ist in diesen Fällen die Arbeitszeit manuell in den Spalten W bis AA einzutragen. (Im Falle eines beginnenden Krankenstands bitte nicht auf das K in Spalte T vergessen.) Fällt die externe Zeit - z.B. der Arztbesuch - innerhalb des Tages an (der Mitarbeiter kommt daher vormittags in die Arbeit und meldet sich an, geht dann zum Arzt und kommt anschließend wieder zurück) und der Mitarbeiter meldet sich also korrekt an und wieder ab, dann ist in der Zeiterfassung kein manueller Eingriff zu machen. Es kann aber Sinn machen die Mitarbeiter anzuweisen den Arztbesuch in der Spalte W zu vermerken."]
[null,null,null,"f.) Zeitausgleich: Zeitausgleich muss in der Zeiterfassung gar nicht erfasst werden. Er ergibt sich automatisch als Differenz zwischen den Soll-Stunden und den IST-Stunden. Hat ein Mitarbeiter an einem Tag GAR NICHTS gearbeitet, gilt der ganze Tag als Zeitausgleich und es entstehen Minus-Stunden (Zeitausgleichstunden) in Höhe der Tages-SOLL-Stunden. Hat ein Mitarbeiter nur ein paar Stunden Zeitausgleich genommen, so gilt nur die Differenz der SOLL-Stunden zu den IST-Stunden als Zeitausgleich und verringern automatisch den Monatszeitsaldo. \n\nBSP: Ein Mitarbeiter hat an einem Tag 9 Soll-Stunden, aber war nur 5 Stunden arbeiten. Er hat an diesem Tag also 5 IST-Stunden und die Differenz zu den 9 Soll-Stunden - die 4 Stunden - wirken sich automatisch verringernd auf den Monatszeitsaldo aus und sind damit automatisch der Zeitausgleich."]
[null,null,null,"4.) Zeitkontrolle durch den Personalverantwortlichen"]
[]
[]
[]
[null,null,null,"Einem Mitarbeiter ist es - in der Regel * - nicht möglich die Zeiten manuell in den Zeiterfassungsspalten E bis H zu erfassen oder abzuändern. \n\n* Sie können natürlich den Mitarbeitern das Passwort für den Tabellenblattschutz geben und die Mitarbeiter können dann ihre Zeiten in den Spalten E bis H sehr wohl selbst ausbessern. In einem versteckten Parameter ist es sogar möglich das automatische Setzen des Tabellenblattschutz bei jedem Speichern der Stundenliste gänzlich zu unterbinden, sodass die Tabellen immer ungeschützt bleiben."]
[null,null,null,"Meist können Mitarbeiter ihre Ergänzungen und Änderungswünsche nur in den Spalten W bis AA erfassen. Prinzipiell sind diese Spalten während des Monats immer für den Mitarbeiter offen.\n\nDer Personalverantwortliche (zB der Geschäftsführer / Teamleiter etc) kann jedoch auch diese Spalten - jeweils bis zu einem wählbaren Stichtag - sperren. \n\nAnschließend haben der Mitarbeiter keine Möglichkeit mehr dort weitere manuelle Korrekturen zu machen. Dadurch hat die Geschäftsführung die Sicherheit, dass die Zeiterfassung zu einem bestimmten Stichtag komplett \"eingefroren\" wird und nicht mehr verändert werden kann (außer natürlich vom Personalverantwortlichen, der das Passwort kennt und damit vollen Zugriff hat.)"]
[]
[null,null,null,"Hinweis: das hier beschriebene \"Einfrieren\" gilt nur für Spalten T und U (Urlaub, Krank, Feiertag) und die manuell befüllbaren Spalten W bis AA, wo der Mitarbeiter nachträgliche Korrekturen erfassen kann."]
[]
[null,null,null,"Dieses \"Einfrieren\" kann einmal in der Woche am Ende der Arbeitswoche oder auch nur einmal im Monat am Monatsende erfolgen. \n\nDer Personalverantwortliche muss dazu das Monatstabellenblatt voll bearbeitbar öffnen:\n\nFür das Öffnen klickt er in der Zelle B12 auf das grüne ZU-Symbol. \n\nEs öffnet sich ein Passwortabfrage-Fenster und man gibt das betreffende Passwort ein, um den Tabellenblattschutz aufzuheben. Das Symbol schaltet um auf das rote AUF-Symbol, (welches bedeutet, dass das Tabellenblatt nun AUF ist.)\n\nAnschließend kann man die erfassten Stunden der Mitarbeiter in den Spalten E-H korrigieren oder ergänzen."]
[]
[]
[]
[null,null,null,"Zuletzt schreibt man in die Spalte B ein OK in die Zeile mit dem betreffenden Tag bis zu dem man die Zeiterfassung kontrolliert hat. \n\nDie Vorlage schlägt automatisch die Freitage mit einem Kästchen vor, aber man kann das OK in der Spalte B auch an jeden anderen Tag setzen, bis zu dem man die Zeiterfassung kontrolliert hat.\n\nEin OK sperrt immer ALLE Tage bis hinunter zu dieser Zeile, wo man das OK macht. So kann man zB durch das Schreiben eines OK beim letzten Tag des Monats das ganze Monat auf einmal sperren. Oder man setzt jede Woche immer am Freitag ein OK, (oder am Samstag etc).\n\nIm nebenstehenden Screenshot sieht man, dass am Fr. den 19. und am Fr. den 26. die Zeiten kontrolliert und mit OK bestätigt worden sind. Die letzten 4 Tage des Monats sind noch offen und der Mitarbeiter kann in den Spalten W-AA für diese 4 Tage noch Änderungen erfassen."]
[]
[]
[]
[null,null,null,"Zuletzt wird man das Tabellenblatt wieder abschließen. Dafür klickt man oben links auf das rote AUF-Symbol, \num das Tabellenblatt wieder in den gesperrten Zustand zu setzen. Es wird das grüne ZU-Symbol sichtbar, welches anzeigt, dass das Tabellenblatt nun ZU ist.\n\nSobald das Tabellenblatt ZU ist, ist der Blattschutz wieder aktiv und die Spalten W-AA sind bis zum letzten OK nicht mehr bearbeitbar. Gleiches gilt auch für Eintragungen in den Spalten T (Krank/Urlaub) und U (Feiertag) Unterhalb des letzten OK kann der Mitarbeiter seine manuellen Eingaben in den Spalten W-AA noch machen."]
[null,null,null,"Tipp: Sobald man die Exceldatei speichert, werden ohnedies immer alle Tabellenblätter abgeschlossen und man kann sich das manuelle Abschließen auf den roten AUF-Button eigentlich ersparen."]
[null,null,null,"Tipp: Sie können in der Paramtertabelle in Zelle F48 auch ein Häkchen setzen, dass beim Monatsabschluss - also beim Klick auf den violetten Button MONATSABSCHLUSS unten links in jeder Monatstabelle - das OK-Feld am letzten Tag im Monat automatisch gesetzt wird. Damit können NACH dem Monatsabschluss keine Änderungen mehr vom Mitarbeiter gemacht werden."]
[null,null,null,"Gutstunden (Mehrstunden): Werden Gutstunden am Ende eines Monats ausbezahlt, können diese in der Zelle R48 im betreffenden Monat eingetragen werden. Dadurch wird der Vortrag des Stundensaldos in das nächste Monat reduziert."]
[null,null,null,"Tipp: Sie haben in jeder Monatstabelle ganz unten in der Zelle E49 die Möglichkeit eine Information an die Lohnverrechnung zu erfassen - etwa, wenn eine Anmerkung für die Abrechnung oder die Auszahlung von Überstunden übermittelt werden soll."]
[]
[null,null,null,"5.) Jahreswechsel"]
[null,null,null,"a.) Wechsel des Kalenderjahres \nSobald der Dezember des abgelaufenen Jahres fertig erfasst ist und im Optimalfall auch schon an die Lohnverrechnung übermittelt wurde, klicken Sie auf die Taste JAHRESWECHSEL in der Tabelle 1 JAN (oben in Zelle R1); alternativ gibt es diesen Buttton auch in der 12 DEZ-Tabelle. Der Assistent für den Jahreswechsel sichert darauf hin die aktuelle Stundenliste in den Unterordner BACKUP im aktuellen Jahresordner, leert dann die Vorlage und speichert sie automatisch im neuen Jahresordner für das neue Jahr. Wenn es den neuen Jahresordner noch nicht gibt, wird er vom Assistenten automatisch angelegt. Wichtig ist dafür, dass Ihr Hauptordner für die Stundenlisten im Namen irgendwo die vierstellige Jahreszahl enthält, zB. 2018. Anschließend erhalten Sie die Möglichkeit die Wochenstunden ab Jänner für den betreffenden Mitarbeiter zu ändern, falls Sie das wollen. Ganz zuletzt legt der Assistent eine Verknüpfung für einen eventuell neu angelegten Jahresordner auf dem Desktop ab."]
[null,null,null,"Durch die Funktion JAHRESWECHSEL werden in den 12 Monatstabellen\n\n- alle erfassten Arbeitsstunden / Überstunden / Mehrstunden und Einträge im Bereich Tätigkeiten (Spalten W-AA)  gelöscht"]
[null,null,null,"- weiters werden alle beweglichen Feiertage in der Spalte U, (die dort von Ihnen mit einem B eingetragen worden sind) gelöscht; \n   (die dort mit F eingetragenen unbeweglichen, fixen Feiertage werden natürlich nicht gelöscht.) Die 4 klassischen beweglichen Feiertage (Ostermontag, Pfingstmontag, Christi Himmelfahrt, Fronleichnam) werden von der Vorlage selbständig eingetragen. Zudem haben Sie in der PARAMETER-Tabelle in den Zellen C39 bis G40 die Möglichkeit die SOLL-Stunden des Mitarbeiters am (automatisch ermittelten) Karfreitag, 24.12 und 31.12 und an 2 weiteren, frei definierbaren Tagen einzutragen. Manche Kollektivverträge sehen zB nur halbe Arbeitstage vor."]
[null,null,null,"- der Dezember-Stundenendsaldo des alten Jahres von der Tabelle 12 DEZ in der Zelle R47 (bzw bei Auszahlung von Gutstunden von R49) wird in der Tabelle 1 JAN in der Zelle R9 (=Vortrag aus Vorjahr) automatisch vorgetragen. (Sollte sich nachträglich herausstellen, dass ein falscher Jahresendsaldo ins neue Jahr vorgetragen wurde, weil z.B. mehr Stunden ausgezahlt wurden etc, können Sie den korrekten Stundensaldo in der Tabelle 1 JAN im neuen Jahr in der Zelle R9 manuell eintragen.)"]
[null,null,null,"- der Dezember-Urlaubstagesaldo des alten Jahres von der Tabelle PARAMETER in der Zelle F36 wird in der Tabelle PARAMETER in der Zelle C36 (=Vortrag aus Vorjahr) automatisch vorgetragen."]
[null,null,null,"- dann wird das Jahr um 1 weitergeschaltet in das nächst höhere Jahr und die beweglichen Feiertage - Karfreitag (falls bei ihm in der Parametertabelle in C40 Soll-Stunden definiert sind), Ostermontag, Pfingstmontag … - eingetragen."]
[null,null,null,"- die eventuell erfassten Fortbildungsinformationen werden gelöscht"]
[null,null,null,"6.) Mehrstunden und Überstunden"]
[null,null,null,"Wenn Sie vom MONATSABSCHLUSS automatisch die Mehr- und Überstunden bewerten lassen, können Sie in jedem Tabellenblatt in der Zelle T6 mit dem Button \"MEHRSTUNDEN\" die Spalten für die Mehr-/Überstundenermittlung einblenden. Nach der Durchführung des Monatsabschlusses durch den violetten Button MONATSABSCHLUSS werden in den so eingeblendeten Spalten ganz rechts die Berechnungsgrundlagen eingeblendet. \n\nWenn ein Automatismus (in der PARAMETER-Tabelle in den Zellen F50 bis F62) so eingestellt wird, dass nicht nur der Zuschlag, sondern auch die Grundstunde ausgezahlt werden soll, muss die ausgezahlte Grundstunde natürlich vom Zeitsaldo abgezogen werden. Diese Korrektur des Monatsendsaldos wird nach dem Monatsabschluss in der Zelle F48 (die Zelle ist leer  und weiß, wenn es keine Korrektur gibt) beim betreffenden Monat ausgewiesen."]
[]
[null,null,null,"7.) Wechsel der Wochenstunden eines Mitarbeiters"]
[null,null,null,"Für das Wechseln der Wochen-SOLL-Stunden - z.B. von einer 40h-Arbeitswoche auf eine 30h-Arbeitswoche - gibt es einen eigenen Assistenten, der Sie durch den gesamten Workflow leitet und alle nötigen Schritte für Sie automatisch erledigt."]
[null,null,null,"Diesen Assistenten rufen Sie in der Tabelle PARAMETER mit dem roten Button WOCHENSTUNDEN ÄNDERN oben rechts in G3 auf."]
[null,null,null,"Verwenden Sie diesen Assistenten dann, wenn bereits die Arbeitszeiten von ein oder mehreren Tage (Monaten...) in der Vorlage erfasst wurden und sich DANACH die Wochen-SOLL-Stunden für die restlichen Monate ÄNDERN sollen. Bei der Erstanlage jedoch verwenden Sie bitte immer den blauen Button ERSTANLAGE NEUE/R MITARBEITERIN."]
[null,null,null,"Den Button WOCHENSTUNDEN ÄNDERN können Sie beliebig oft während des Jahres wählen. Dabei geschieht immer Folgendes:\n- Zuerst werden Sie gefragt AB welchem Datum die neue Stundenanzahl gelten soll (dies ganz auch mitten im Monat, oder sogar mitten in der Woche geschehen).\n- Dann werden Sie nach den SOLL-Stunden von jedem Wochentag gefragt, die in Summe natürlich genau jene Wochenstundenanzahl ergeben müssen, mit der der Mitarbeiter bei der Krankenkasse angemeldet ist"]
[null,null,null,"- Nach einer letzten Bestätigungsfrage, ob Sie die Änderung wirklich durchführen lassen wollen, werden vom Programm ab dem gewünschten Änderungsdatum alle SOLL-Stunden in den restlichen Tagen des Jahres gemäß Ihrer Änderung eingetragen.\n- Zusätzlich wird das abgelaufene Wochenmodell in der Tabelle PARAMETER ab Zeile 300 unten protokolliert, da in den Zellen D6:D12 immer das aktuell aktive Wochenmodell zu sehen ist."]
[]
[null,null,null,"8.) Spezialfall kürzere Tage gemäß Kollektivvertrag"]
[null,null,null,"In etlichen Kollektivverträgen (KV) gibt es für einzelne Tage im Jahr Sondernregelungen: so sind etwa der Karfreitag, der Weihnachtstag oder Silvester in manchen Fällen ab 12 h frei."]
[null,null,null,"Beispiel: in manchen KVs ist der Karfreitag ab 12 h frei. Wenn die normale Arbeitszeit bei einem Mitarbeiter z.B. von 8h bis 14h geht - was an einem normalen Freitag einer SOLL-Arbeitszeit von 6h entspricht - so wäre die SOLL-Arbeitszeit am Karfreitag für diesen Mitarbeiter nur 4h."]
[null,null,null,"In der Tabelle PARAMETER können Sie für insgesamt 5 Tage solche SOLL-Zeitenkürzungen eintragen. Drei Tage sind vorgeschlagen (Karfreitag, Heiligabend 24.12 und Silvester) und Sie können für zwei weitere Tage ein beliebiges Datum eintragen. \n\nMit diesem Automatismus können Sie z.B. für evangelische Mitarbeiter am Karfreitag generell 0 Stunden eintragen, da sie an diesem Tag gänzlich frei haben. Für einen anderen Mitarbeiter geben Sie die Stundenanzahl an, die der Mitarbeiter an diesem Tag zu arbeiten hat. Gibt der KV z.B. eine Arbeit bis 12:00 vor und der Mitarbeiter arbeitet freitags üblicherweise von 9h-15h (Soll-Stunden normal: 6), dann tragen Sie beim Karfreitag bei ihm die gekürzte SOLL-Stundenanzahl von 3 ein, (9h-12h)."]
[null,null,null,"WICHTIG: Wenn Sie Einstellungen für diese kürzeren Sondertage eintragen, wirkt sich diese Einstellung ERST dann aus, wenn Sie auf einen der drei Buttons klicken: ERSTANLAGE NEUE/R MITARBEITER/IN - oder WOCHENSTUNDEN ÄNDERN - oder JAHRESWECHSEL. Im Optimalfall treffen Sie daher die Einstellung immer BEVOR Sie einen Mitarbeiter neu anlegen oder seine Wochenstunden ändern oder vor dem Jahreswechsel. Sie können aber auch nach dem Erfassen der Spezialtage die SOLL-Zeiten des Mitarbeiters neu eintragen lassen, indem Sie mit dem Button WOCHENSTUNDEN ÄNDERN arbeiten und dabei die täglichen SOLL-Stunden gleich lassen; wichtig ist es jedoch, dass Sie als ÄNDERUNGSDATUM das letzte, neueste Änderungsdatum eintragen, das Sie in der Tabelle PARAMETER in der Zelle F13 sehen. Denn ab diesem Datum werden in der Monatstabellen alle SOLL-Stunden mit dem aktuellen Wochenmodell beschrieben und dabei die Einstellungen der 5 Sondertage (Karfreitag, Heiligabend, Silvester...) berücksichtigt."]
[]
[null,null,null,"9.) Weitere Funktionen im Tabellenblatt PARAMETER"]
[null,null,null,"Mit der Schaltfläche LIZENZCODE EINGEBEN können Sie den erworbenen Lizenzschlüssel eingeben - dabei ist die Groß-Kleinschreibung nicht von Bedeutung. Um einen Lizenzschlüssel zu erwerben, wenden Sie sich bitte an unsere Webseite www.simplesoft.at "]
[null,null,null,"Der Button ERZEUGE LEERE VORLAGE macht aus der aktuellen Datei eine neue, leere Vorlage, indem alle erfassten Zeiten und Werte gelöscht werden. Sie werden diese Funktion nur in Ausnahmefällen benötigen, denn üblicherweise beginnen Sie ja immer mit einer neuen, leeren Vorlage, die Sie auch mit einem entsprechenden Dateinamen (zB Vorlage Zeiterfassung) speichern."]
[null,null,null,"Mit der Funktion PASSWORT ÄNDERN können Sie das Passwort für den Tabellenblattschutz ändern. Wenn Sie mehrere Stundenlisten im Einsatz haben, sollten Sie das neue Passwort auch in den anderen Stundenlisten geändert werden."]
[null,null,null,"Die Funktion SALDOVORTRAG REPARIEREN benötigen Sie nur, wenn Sie in einer Tabelle die Formel für den Vortrag des Monatssaldos in der Zelle R9 manuell überschrieben haben. Mittels der Reparatur werden die Formeln aller Monate korrekt wiederhergestellt. Beim Jahreswechsel wird diese Funktion übrigens automatisch durchgeführt."]
[null,null,null,"Die Funktion TAGESFORMELN REPARIEREN benötigen Sie dann, wenn Sie bei einem einzelnen Tag (oder mehreren Tagen) die Formeln in den Spalten I, J, R, S oder AQ geändert haben. Mittels der Reparatur werden die Formeln aller Tageszeilen in allen Monaten korrekt wiederhergestellt. Beim Jahreswechsel wird diese Funktion ohnedies automatisch durchgeführt."]
[null,null,null,"Die Funktionen DEVELOP-BEREICH ÖFFNEN / SCHLIESSEN sind der Programmierung und Testung vorbehalten. Eine Zusatzfunktion kann darin freigeschalten werden: \n\n- etwa dass beim Speichern der Vorlage der Tabellenblattschutz nicht automatisch gesetzt wird; (dies kann Sinn machen, wenn der Tabellenblattschutz nie gesetzt werden und die Stundenliste für den Mitarbeiter immer voll bearbeitbar sein soll)."]
[null,null,null,"Der Button VBA-Code reaktivieren wird nur in der Entwicklung der Software verwendet. Wenn der VBA-Code vorübergehend pausiert wird, kann man ihn damit wieder aktivieren. Immer wenn Sie die Zeiterfassungsdatei öffnen, ist der VBA-Code automatisch immer aktiviert und Sie benötigen diesen Button daher nicht."]
[]
[null,null,null,"10.) Automatisches Übernehmen der manuellen Buchungen"]
[null,null,null,"Wenn Ihre Mitarbeiter manuell in den Spalten W bis AA Zeiten erfasst haben, können Sie diese mit dem ROTEN KREUZ-Button \nautomatisch in die Zeitspalten E bis H übernehmen."]
[null,null,null,"Einzige Voraussetzung ist, dass Sie den Blattschutz der betreffenden Tabelle geöffnet haben und den roten AUF-BUTTON sehen.\n\nSollten Sie den roten AUF-BUTTON nicht sehen, klicken Sie wie gewohnt auf den grünen ZU-BUTTON und geben das Passwort \nein, damit der Blattschutz geöffnet wird."]
[null,null,null,"Das Programm überträgt alle erfassten manuellen Zeiten aus den Spalten W bis AA und überprüft anschließend, ob der aktuelle Tag vollständig erfasst wurde."]
[null,null,null,"Alternativ können Sie das Übertragen der manuell erfassten Zeiten auch direkt mit dem violetten Button MONATSABSCHLUSS unten links in jeder Monatstabelle ausführen lassen. Sie müssen dazu nur einmal in der Parametertabelle in der Zeile 46 für den Monatsabschluss die Übernahme der manuellen Zeiten aktivieren. \n\nDabei haben Sie zwei Möglichkeiten: "]
[null,null,null,"1.) eine vollautomatische Übernahme: in diesem Fall bitte vor dem monatlichen Klick auf den Button MONATSABSCHLUSS einen kurzen Blick auf die manuell erfassten Zeiten in den Spalten W bis AA werfen, ob diese in Ordnung sind\n\n2.) eine Übernahme mit täglicher Einzelfrage: in diesem Fall bekommen Sie bei jedem Tag, an dem der Mitarbeiter manuelle Zeiten in den Spalten W bis AA erfasst hat, eine Frage, ob Sie die Zeiten des betreffenden Tages übernehmen wollen."]
[]
[null,null,null,"11.) Summen"]
[null,null,null,"Die Summentabelle dient \n\n- zum Aufsummieren der erfassten Stunden in den 12 Monaten und \n\n- zum Aufsummieren aller erfasster Urlaubstage, Krankenstandstage, Pflegeurlaubstage und sonstigen Dienstfreistellungen, wie sie in der Spalte T eingetragen werden können durch die entsprechenden Kürzel."]
[]
[null,null,null,"12.) Internetverprobung"]
[null,null,null,"Wenn der PC, auf dem diese Software läuft, mit dem Internet verbunden ist, kann in den ausgeblendeten Spalten AE-AN der genaue Zeitpunkt der An- und Abmeldungen mit einem Online-Atomzeitserver gegenverprobt und protokolliert werden."]
[null,null,null,"In der Tabelle PARAMETER gibt es  in Zeile 38 den violetten Wechselschalter INTERNETZEIT EIN/AUS, mit dem die betreffenden Spalten in den 12 Monatstabellen zu Kontrollzwecken ein- und ausgeblendet werden können. Manchmal sind die entsprechenden Online-Zeitserver nicht erreichbar und es werden Fehlermeldungen ausgewiesen. Wenn das zu häufig vorkommt und stört, deaktivieren Sie Internet-Verprobung einfach in der PARAMETER-Tabelle in der Zelle G32."]
[]
[null,null,null,"13.) Updates"]
[null,null,null,"In der Tabelle PARAMETER können Sie mit dem Button UPDATE bereits erfasste Daten aus einer alten Version der Zeiterfassung in eine aktuelle, neue Vorlagenversion übernehmen. Prinzipiell benötigen Sie kein Update, weil die Vorlage als solches ja korrekt arbeitet. Wenn Sie aber auf unser Homepage www.simplesoft.at im Bereich EXCEL-TOOLS / ZEITERFASSUNG neue Funktionen beschrieben finden, die Sie gerne verwenden möchten, nehmen Sie gerne bezüglich einem Update Kontakt mit uns auf. In den ersten drei Jahren nach dem Erwerb der Zeiterfassung sind die Updates für Sie kostenlos.\n\nHier eine kurze Anleitung, wie das sehr einfache Update gemacht werden kann, sobald Sie von uns eine neue Vorlage erhalten haben:"]
[null,null,null,"1) Benennen Sie die bisherige Stundenliste von z.B. Herrn MEIER um von \"MEIER\" auf \"MEIER alt\". (Und danach bitte diese Datei nicht öffnen.)"]
[null,null,null,"2) Öffnen Sie die neue, leere Zeiterfassungsvorlage und speichern diese mit dem Namen des Mitarbeiters in das Verzeichnis, wo die alte Stundenliste des Mitarbeiters ist. Verwenden Sie dabei den Namen der bisherigen Stundenliste: also \"MEIER\". \n\n(Diesen Speichervorgang mit der Möglichkeit der Benennung der Datei finden Sie in Excel immer im Menü DATEI / SPEICHERN UNTER.)"]
[null,null,null,"3) Zuletzt klicken Sie in der so gespeicherten noch leeren Vorlage im Blatt PARAMETER auf den grünen UPDATE-Button in der Zelle I13. Der Assistent führt Sie automatisch durch den Updatevorgang - wobei Sie ohnedies nur bei einem sich automatisch öffnenden DATEIAUSWAHL-Fenster die alte Stundenliste \"MEIER alt\" auswählen. \n\nDer Assistent liest dann alle bisher erfassten Daten - sowohl die Einstellungen in den Parametern als auch die erfassten Zeiten und Urlaube/Krankenstände - aus und überträgt sie in die neue Vorlage. Wenn Sie diese zuletzt dann noch einmal speichern (ohne dass jetzt irgendwas mit dem Dateinamen noch berücksichtigt werden muss - denn das haben Sie bereits unter dem Punkt 2 erledigt), ist das Update fertig."]
[null,null,null,"Tipp: Wenn Sie möchten, können Sie die alte Stundenliste des Mitarbeiters noch verschieben in einen Unterordner - z.B. mit dem Namen LAGER oder ALTE STUNDENLISTEN - damit der Mitarbeiter nicht irrtümlich noch die alte Stundenliste verwendet."]
[]
[null,null,null,"14.) Kontrolle der Zeiterfassung"]
[null,null,null,"Wenn Sie oder Ihre Mitarbeiter die Zeiterfassung kontrollieren wollen, empfiehlt sich folgende Vorgehensweise:\n\n1) Zuerst vergleicht man die tatsächlich gebuchten Zeiten in den Spalten E-H und wirft einen Blick auf die Spalten I und J, weil man hier sofort sieht, wie viel man hätte arbeiten sollen (Spalte J) und wie viel man tatsächlich gearbeitet hat (Spalte I). Die Differenz wird im Falle von Mehrarbeit in der Spalte R als PLUS-Stunden angezeigt und ansonsten als Zeitausgleich in der Spalte S mit den MINUS-Stunden; (letztere werden nicht mit Minus angezeigt)."]
[null,null,null,"In der Parameter-Tabelle können Sie in Zelle K29 eine Grenzstundenanzahl eingeben - z.B. 10 - damit Sie sofort alle Tage mit mehr als dieser Stundenanzahl rot gefärbt hervorgehoben bekommen. Diese Färbung hat nur informative Zwecke und keine funktionale Konsequenz."]
[null,null,null,"2) In der Zeile 45 sehen Sie die Summen aller Spalten: in der Spalte I ist die Summe der tatsächlich gearbeiteten Stunden des Monats und in Spalte J die SOLL-Stunden für den ganzen Monat. Die Differenz von diesen beiden ergibt den Monatssaldo, der in Zelle R46 kontrolliert werden kann.\n\nTipp: Für alle Kontrollen ist es wichtig zwischen Arbeitszeit und Anwesenheitszeit zu unterscheiden. An einem Tag mit 8,5 h Arbeitszeit wird man 9 h in der Arbeit sein, da bei den 9 h auch die (in der Regel) halbe Stunde Mittagspause enthalten ist, die aber nicht als Arbeitszeit gilt und daher auch in der ausgewiesenen SOLL-Arbeitszeit in Spalte J nicht enthalten ist."]
[null,null,null,"3) In der Zelle R45 ist die Summe der Plusstunden eines Monats und in der Zelle S45 ist die Summe der Minusstunden. Zusammengenommen ergeben Sie den Monatssaldo, den man in Zelle R46 sieht. Dieser Saldo ist natürlich gleich wie Differenz aus der IST-Stunden-Monatssumme (Zelle I45) und der SOLL-Stunden-Monatssumme (Zelle J45).\n\n4) Zählt man diesen Monatssaldo (Zelle R46) mit dem Vortrag aus dem Vormonat (Zelle R9) zusammen, erhält man den endgültigen Monatssaldo inklusive Vormonatssaldo, den man in Zelle R47 ausgewiesen sieht."]
[null,null,null,"Tipp: In der Tabelle PARAMETER können Sie in der Zelle K21 einen eigenen Kontrollsummenbereich in allen 12 Monatstabellen im rechten, unteren Bereich einblenden, der AM MONATSENDE die IST-/SOLL-Stunden-Monatssummen mit den PLUS-/MINUS-Stunden-Monatssummen vergleicht und auch eventuell automatisch übernommene Überstunden extra berücksichtigt."]
[null,null,null,"Tipp: Wenn Sie an die Lohnverrechnung eine wichtige Info für einen bestimmten Monat melden wollen, können Sie das in jeder Monatstabelle in der Zelle E49 machen. Ein Beispiel wäre eine Info zur Auszahlung von Überstunden."]
[]
[null,null,null,"15.) Urlaubsverwaltung"]
[]
[null,null,null,"Diese Zeiterfassung hier hat den Schwerpunkt der Zeitaufzeichnungen und ist keine vollautomatische Urlaubsverwaltung. Urlaube können erfasst werden und in jedem Monat sehen Sie in der Zelle T45 die Summe der Urlaubstage in diesem Monat. In der Tabelle SUMMEN sehen Sie auch die Summe der Urlaubstage im gesamten Jahr."]
[null,null,null,"Eine minimale Urlaubsverwaltung ist in der Parameter-Tabelle in der Zeile 36 vorbereitet. Hier können Sie in der Zelle B36 den jährlichen Urlaubsanspruch in Tagen eingeben: in der Regel hat jeder Mitarbeiter 5 Wochen Urlaub im Jahr - bei einer 5-Tage-Arbeitswoche sind das 25 Tage im Jahr, bei einer 4-Tage-Woche sind es 20 Tage, bei einer 2-Tage-Woche nur 10 Tage."]
[null,null,null,"In der Zelle C36 können Sie einen Urlaubsanspruch aus Vorjahren eintragen, der im aktuellen Jahr noch zur Verfügung steht. Als Urlaubsjahr wird in diesem Tool das Kalenderjahr verstanden. Daher: immer am 1.1. entsteht ein neuer Urlaubsanspruch. Bei vielen Dienstverträgen beginnt das Urlaubsjahr aber immer mit dem Monat des Ersteintrittes des Mitarbeiters. In diesem Fall muss der Urlaubsanspruch separat errechnet werden und hier in der Zeiterfassung kann nur der aktuelle Jahres-Urlaubsverbrauch erfasst und ausgewertet werden."]
[null,null,null,"Wichtig ist auch, dass sich der Urlaubsanspruch beim Wechseln des Wochenmodells auf mehr oder weniger Arbeitstage in der Woche ändert. Hat ein Mitarbeiter bei einer 2-Tageswoche z.B. einen offenen Urlaubsanspruch von 10 Tagen und er wechselt auf eine 4-Tageswoche, so erhöht sich sein Urlaubsanspruch auf 20 Tage. (Berechnungstheorie: offene Urlaubstage DIVIDIERT durch Anzahl Arbeitstage in der Woche VOR dem Wechsel MULTIPLIZIERT mit der Anzahl der Arbeitstage in der Woche NACH dem Wechsel.)"]
[null,null,null,"Für die genaue Urlaubsberechnung hilft Ihnen gerne Ihre Lohnverrechnung. Es reicht, wenn die Mitarbeiter hier die Urlaube erfassen und Sie den jährlichen Urlaubsverbrauch an die Lohnverrechnung melden."]
[]
[]
[null,null,null,"16.) Fragen und Kontakt"]
[]
[null,null,null,"Bei allgemeinen Fragen zur Arbeitszeitaufzeichnung wenden Sie sich bitte an Ihre Lohnverrechnung. \n\nFür Fragen und Anregungen zum Arbeiten mit der Vorlage hier können Sie uns gerne über unsere Homepage www.simplesoft.at erreichen. Oder direkt per Mail an mich, Stefan Wenninger und meine Emailadresse info@simplesoft.at "]
[null,null,null,"Wir wünschen Ihnen ein erfreuliches Arbeiten mit der Vorlage"]

{"sheet":"VBA-Aktivierung","index":1,"n_rows":27,"n_cols":10,"rows_kept":27,"cut":false,"hidden":false,"merged":[[3,3,3,10],[4,3,4,10],[6,3,6,10],[16,3,16,10],[17,3,17,10],[5,3,5,10],[8,3,8,10],[10,9,10,10],[13,4,13,5],[13,6,13,8],[13,9,13,10],[7,3,7,10],[11,3,11,10],[14,3,14,10],[15,3,15,10],[29,3,29,10],[9,3,9,10],[12,3,12,10],[10,4,10,5],[10,6,10,8],[18,3,18,10],[28,3,28,10],[26,3,27,10],[19,3,19,10],[22,3,22,10],[23,3,23,10],[24,3,24,10],[21,3,21,10],[25,3,25,10],[20,3,20,10]]}
[false]
[]
[]
[null,null,null,"Willkommen zur Zeiterfassung"]
[null,null,null,"1.) Sehr wichtig bitte !"]
[null,null,null,"Da Sie diesen Text hier lesen können, bedeutet dies, dass in Ihrem Excel das Ausführen von Programmcode deaktiviert ist, (denn sonst hätte der Programmcode diese Tabelle hier ausgeblendet.)\n\nFolgen Sie bitte den nachfolgenden Schritten, um in Ihrem Excel das Ausführen von Programmcode zu erlauben."]
[null,null,null,"Worum geht es eigentlich: diese Vorlage hat vielfältigen Programmcode (=Makros), um die Zeiterfassung mit umfassenden Automatismen zu unterstützen. Dieser Programmcode  funktoniert allerdings nur, wenn Sie in Ihrem Excel die Sicherheitseinstellungen so gewählt haben, dass das Ausführen von Makro-Code erlaubt wird."]
[null,null,null,"Microsoft hat die freiwillig aktivierbare Sperre von VBA-Makros-Programmcode deshalb eingebaut, weil auch Computervieren über schädlichen VBA-Code auf Rechnern Schaden auslösen können. Da schädlicher VBA-Code aber ohnedies von jedem Antivirenprogramm sehr leicht gefunden werden kann, können Sie den VBA-Code in Ihrem Excel ganz aktivieren, wenn Sie ein Antivirenprogramm installiert haben. "]
[null,null,null,"Wenn Sie KEIN Antivirenprogramm installiert haben, wählen Sie die in der nachfolgenden Anleitung sicherheitshalber die Einstelung MAKROS MIT BENACHRICHTIGUNG DEAKTIVIEREN. Dann müssen Sie allerdings bei jedem Start der Zeiterfassung auf die nachfolgend beschriebene Schaltfläche \"Inhalt aktivieren\" klicken. Wir empfehlen Ihnen besser eine Antivirensoftware zu installieren; selbst kostenlose Antivirenprogramme wie die von AVAST oder AVG schützen sehr gut gegen VBA-Viren."]
[null,null,null,"Wenn Sie beim Öffnen der Zeiterfassungsvorlage oben direkt unter der Menüleiste folgende Zeile sehen, hat Excel den VBA-Code gesperrt; durch Klick auf die Schaltfläche INHALT AKTIVIEREN können Sie den VBA-Code aktivieren. "]
[null,null,null,null,"Sicherheitswarnung",null,"Makros wuden deaktiviert",null,null,"Inhalt aktivieren"]
[]
[null,null,null,"Möglich ist auch, dass Sie folgende Hinweismeldung sehen und auch hier können Sie mit Klick auf die Schaltfläche BEARBEITUNG AKTIVIEREN den VBA-Programmcode aktivieren:"]
[null,null,null,null,"Geschützte Ansicht",null,"Diese Datei stammt von einem Internetspeicherort und kann …",null,null,"Bearbeitung aktivieren"]
[null,null,null,"Dieser obige Hinweis auf die geschützte Ansicht kommt in Excel immer dann, wenn Sie eine Exceldatei direkt aus dem Internet heruntergeladen und geöffnet haben, oder wenn Sie eine Exceldatei direkt aus einer Email öffnen. In beiden Fällen verwenden Sie bitte unbedingt in Excel die SPEICHERN UNTER - Funktion und speichern die Datei in einen Ordner, den Sie leicht finden können. Mehr über den optimalen Speicherort finden Sie in der Tabelle ANLEITUNG beschrieben."]
[null,null,null,"Lesen Sie nun, wie Sie den VBA-Code in Ihrem Excel bleibend aktivieren können:"]
[null,null,null,"Aktivieren der VBA-Sicherheitseinstellungen unter EXCEL 2007, 2010 und 2013"]
[null,null,null,"Um in Excel 2007, 2010 und 2013 Makros zu aktivieren gehen Sie bitte so vor:"]
[null,null,null,"Klicken Sie in Excel 2007 auf den bunten Office-Button oben links bzw. in Excel 2010/2013 auf das Menü Datei und wählen ganz unten den Punkt OPTIONEN."]
[null,null,null,"Dann wählen Sie im sich öffnenden Fenster im linken Bereich in Excel 2007 unten den Punkt VERTRAUENSSTELLUNGSCENTER bzw. in Excel 2010/2013 den Punkt SICHERHEITSCENTER (TRUST CENTER in manchen Versionen genannt)."]
[null,null,null,"Anschließend können Sie im selben Fenster in Excel 2007 rechts auf die Schaltfläche EINSTELLUNGEN FÜR DAS VERTRAUENSCENTER bzw. in Excel 2010/2013 auf SICHERHEITSCENTER (Trustcenter Settings) klicken."]
[null,null,null,"Im nächsten Fenster wählen Sie links in der Mitte den Punkt EINSTELLUNGEN FÜR MAKROS. Nun gibt es folgende zwei Auswahlmöglichkeiten:"]
[null,null,null,"I) Möchten Sie bei jedem Öffnen der Zeiterfassung gefragt werden, ob Sie den Makrocode erlauben wollen, klicken Sie im rechten Fensterteil auf den Punkt ALLE MAKROS MIT BENACHRICHTIGUNG DEAKTIVIEREN. "]
[null,null,null,"II) Wenn Sie keine fremden Exceltabellen mit VBA-Code erhalten oder ein gutes Antivirenprogramm haben, können Sie die Sicherheitseinstellungen auch auf ALLE MAKROS AKTIVIEREN stellen - dann müssen Sie nicht bei jedem Öffnen der Vorlage auf AKTIVIEREN klicken."]
[]
[]
[null,null,null,"Wir wünschen Ihnen ein erfreuliches Arbeiten mit der Vorlage"]

{"sheet":"Parameter","index":2,"n_rows":300,"n_cols":256,"rows_kept":300,"cut":false,"hidden":false,"merged":[[67,20,67,25],[68,20,68,25],[71,17,73,19],[70,17,70,19],[48,17,61,19],[61,5,61,7],[55,5,55,7],[57,5,57,7],[57,8,57,9],[67,17,67,19],[69,17,69,19],[68,17,68,19],[48,5,48,7],[49,5,49,7],[49,1,49,3],[48,1,48,3],[51,1,51,3],[49,14,49,15],[57,14,57,15],[51,5,51,7],[53,5,53,7],[53,1,53,3],[55,1,55,4],[23,5,23,6],[25,4,26,6],[25,8,26,9],[23,8,23,10],[23,1,23,4],[47,1,47,3],[47,8,47,9],[46,1,46,2],[35,8,35,10],[28,1,29,4],[25,10,26,10],[37,1,39,1],[21,12,22,12],[21,13,22,13],[2,8,3,8],[4,8,6,8],[8,10,10,10],[4,10,6,10],[299,1,299,9],[57,12,57,13],[49,12,49,13],[90,1,90,4],[43,4,44,5],[57,1,57,4],[48,8,48,9],[45,1,45,4],[34,8,34,9],[25,1,26,3],[33,1,33,4],[33,5,33,6],[33,8,33,10],[28,10,29,10],[31,8,31,9],[31,1,31,4],[31,5,31,6],[28,8,29,9],[2,10,3,10],[14,2,14,5],[15,2,15,5],[8,8,10,8],[2,2,3,3],[2,4,3,5],[20,8,21,10],[17,8,18,10],[20,1,21,5],[81,2,81,3],[81,4,81,5],[81,6,81,9],[80,2,80,9],[61,1,61,4],[300,1,300,9],[59,1,59,3],[59,5,59,7],[59,8,59,9],[67,0,67,3],[68,1,68,3],[69,1,69,3],[70,1,70,3],[71,1,71,3],[72,1,72,3],[67,8,67,11],[73,1,73,3],[324,1,324,9],[325,1,325,9],[326,1,326,9],[327,1,327,9],[301,1,301,9],[302,1,302,9],[309,1,309,9],[310,1,310,9],[311,1,311,9],[306,1,306,9],[307,1,307,9],[308,1,308,9],[322,1,322,9],[323,1,323,9],[314,1,314,9],[315,1,315,9],[316,1,316,9],[317,1,317,9],[318,1,318,9],[319,1,319,9],[320,1,320,9],[321,1,321,9],[303,1,303,9],[373,1,373,9],[364,1,364,9],[365,1,365,9],[374,1,374,9],[399,1,399,9],[394,1,394,9],[395,1,395,9],[396,1,396,9],[397,1,397,9],[398,1,398,9],[389,1,389,9],[390,1,390,9],[391,1,391,9],[392,1,392,9],[393,1,393,9],[351,1,351,9],[352,1,352,9],[353,1,353,9],[344,1,344,9],[343,1,343,9],[363,1,363,9],[387,1,387,9],[388,1,388,9],[379,1,379,9],[380,1,380,9],[381,1,381,9],[382,1,382,9],[383,1,383,9],[376,1,376,9],[377,1,377,9],[378,1,378,9],[346,1,346,9],[384,1,384,9],[385,1,385,9],[386,1,386,9],[369,1,369,9],[370,1,370,9],[371,1,371,9],[372,1,372,9],[1,12,2,12],[1,13,2,13],[2,11,3,11],[4,11,6,11],[375,1,375,9],[366,1,366,9],[367,1,367,9],[368,1,368,9],[334,1,334,9],[335,1,335,9],[336,1,336,9],[337,1,337,9],[338,1,338,9],[359,1,359,9],[360,1,360,9],[361,1,361,9],[362,1,362,9],[354,1,354,9],[355,1,355,9],[356,1,356,9],[357,1,357,9],[358,1,358,9],[349,1,349,9],[350,1,350,9],[0,12,0,13],[9,12,10,13],[347,1,347,9],[348,1,348,9],[339,1,339,9],[12,12,12,13],[330,1,330,9],[331,1,331,9],[332,1,332,9],[333,1,333,9],[329,1,329,9],[312,1,312,9],[313,1,313,9],[304,1,304,9],[305,1,305,9],[328,1,328,9],[0,2,0,5],[17,6,18,6],[17,1,18,5],[340,1,340,9],[341,1,341,9],[342,1,342,9],[345,1,345,9],[16,12,16,13]]}
["DEMO-Version","200226",{"$f":"N2&N4&N5&N6&N7&N8","v":""},null,null,null,null,null,null,null,null,null,"WARNHINWEISE"]
[null,null,null,null,null,null,null,null,null,null,null,null,"Warnhinweis Mittagspause-Verlängerung",{"$f":"IF(K35<>\"\",\"Achtung Mittagspausenfrage ist aktiv\",\"\")","v":""}]
[null,null,"WOCHENMODELL\nNORMALARBEITSZEIT SOLLSTUNDEN",null,"Mittagspause\nautomatisch\nverbuchen",null,null,null,null,null,null,null,null,null,null,null,null,null,null,null,null,null,null,null,null,null,null,null,null,null,null,null,null,null,null,null,null,null,null,null,null,null,null,null,null,null,null,null,null,null,null,null,null,null,null,null,null,null,null,null,null,null,null,null,null,null,null,null,null,null,null,null,null,null,null,null,null,null,null,null,null,null,null,null,null,null,null,null,null,null,null,null,null,null,null,null,null,null,null,null,null,null,null,null,null,null,null,null,null,null,null,null,null,null,null,null,null,null,null,null,null,null,null,null,null,null,null,null,null,null,null,null,null,null,null,null,null,null,null,null,null,null,null,null,null,null,null,null,null,null,null,null,null,null,null,null,null,null,null,null,null,null,null,null,null,null,null,null,null,null,null,null,null,null,null,null,null,null,null,null,null,null,null,null,null,null,null,null,null,null,null,null,null,null,null,null,null,null,null,null,null,null,null,null,null,null,null,null,null,null,null,null,null,null,null,null,null,null,null,null,null,null,null,null,null,null,null,null,null,null,null,null,null,null,null,null,null,null,null,null,null,null,null,null,null,null,null,null,null,null,null,null,null,null,null,787]
[null,null,null,null,null,null,1,null,null,null,null,null,"Warnhinweis automatische Zeitverbuchung",{"$f":"IF(K81=TRUE,\" - Achtung automatische Zeitenverbuchung\",\"\")","v":""}]
[null,null,"Wochentag","Stunden","Mittag ist ab","Mittag ist bis",null,null,null,null,null,null,"Kein Schutz beim Speichern",{"$f":"IF(N14<>\"\",\" - Achtung kein Blattschutz beim Speichern\",\"\")","v":""}]
[null,null,"Mo",0,"14:00:00","14:30:00",null,null,null,null,null,null,"Demomodus nicht beenden",{"$f":"IF(N15<>\"\",\" - Achtung Demomodus bleibt beim Speichern\",\"\")","v":""}]
[null,null,"Di",0,"14:00:00","14:30:00",null,null,null,null,null,null,"Warnung kein Saldovortrag",{"$f":"IF(F34=FALSE,\" - Achtung kein Saldovortrag ins Folgemonat\",\"\")","v":""}]
[null,null,"Mi",0,"14:00:00","14:30:00",null,null,null,null,null,null,"Keine Buchungen nötig",{"$f":"IF(G29=TRUE,\" - Achtung Tage ohne Buchung gelten als voll gearbeitet\",\"\")","v":""}]
[null,null,"Do",0,"15:00:00","15:30:00"]
[null,null,"Fr",0,"12:00:00","12:00:00",null,null,null,null,null,null,"BIG RESET mit Lizenzcode DEMO machen",null,null,null,null,null,null,null,null,null,null,null,null,null,null,null,null,null,null,null,null,null,null,null,null,null,null,null,null,null,null,null,null,null,null,null,null,null,null,null,null,null,null,null,null,null,null,null,null,null,null,null,null,null,null,null,null,null,null,null,null,null,null,null,null,null,null,null,null,null,null,null,null,null,null,null,null,null,null,null,null,null,null,null,null,null,null,null,null,null,null,null,null,null,null,null,null,null,null,null,null,null,null,null,null,null,null,null,null,null,null,null,null,null,null,null,null,null,null,null,null,null,null,null,null,null,null,null,null,null,null,null,null,null,null,null,null,null,null,null,null,null,null,null,null,null,null,null,null,null,null,null,null,null,null,null,null,null,null,null,null,null,null,null,null,null,null,null,null,null,null,null,null,null,null,null,null,null,null,null,null,null,null,null,null,null,null,null,null,null,null,null,null,null,null,null,null,null,null,null,null,null,null,null,null,null,null,null,null,null,null,null,null,null,null,null,null,null,null,null,null,null,null,null,null,null,null,null,null,null,null,null,null,null,null,null,null,null,null,null,null,null,null,"DEMO"]
[null,null,"Sa",0,"12:00:00","12:00:00"]
[null,null,"So",0,"12:00:00","12:00:00",null,null,null,null,null,null,null,null,null,null,null,null,null,null,null,null,null,null,null,null,null,null,null,null,null,null,null,null,null,null,null,null,null,null,null,null,null,null,null,null,null,null,null,null,null,null,null,null,null,null,null,null,null,null,null,null,null,null,null,null,null,null,null,null,null,null,null,null,null,null,null,null,null,null,null,null,null,null,null,null,null,null,null,null,null,null,null,null,null,null,null,null,null,null,null,null,null,null,null,null,null,null,null,null,null,null,null,null,null,null,null,null,null,null,null,null,null,null,null,null,null,null,null,null,null,null,null,null,null,null,null,null,null,null,null,null,null,null,null,null,null,null,null,null,null,null,null,null,null,null,null,null,null,null,null,null,null,null,null,null,null,null,null,null,null,null,null,null,null,null,null,null,null,null,null,null,null,null,null,null,null,null,null,null,null,null,null,null,null,null,null,null,null,null,null,null,null,null,null,null,null,null,null,null,null,null,null,null,null,null,null,null,null,null,null,null,null,null,null,null,null,null,null,null,null,null,null,null,null,null,null,null,null,null,null,null,null,null,null,null,null,null,null,null,null,null,null,null,null,1]
[null,null,"Summe",{"$f":"SUM(D6:D12)","v":0},"gültig ab:",null,null,null,null,null,3,null,"ADMIN MODUS IMMER AN",null,null,null,null,null,null,null,null,null,null,null,null,null,null,null,null,null,null,null,null,null,null,null,null,null,null,null,null,null,null,null,null,null,null,null,null,null,null,null,null,null,null,null,null,null,null,null,null,null,null,null,null,null,null,null,null,null,null,null,null,null,null,null,null,null,null,null,null,null,null,null,null,null,null,null,null,null,null,null,null,null,null,null,null,null,null,null,null,null,null,null,null,null,null,null,null,null,null,null,null,null,null,null,null,null,null,null,null,null,null,null,null,null,null,null,null,null,null,null,null,null,null,null,null,null,null,null,null,null,null,null,null,null,null,null,null,null,null,null,null,null,null,null,null,null,null,null,null,null,null,null,null,null,null,null,null,null,null,null,null,null,null,null,null,null,null,null,null,null,null,null,null,null,null,null,null,null,null,null,null,null,null,null,null,null,null,null,null,null,null,null,null,null,null,null,null,null,null,null,null,null,null,null,null,null,null,null,null,null,null,null,null,null,null,null,null,null,null,null,null,null,null,null,null,null,null,null,null,null,null,null,null,null,null,null,null,null,null,null,null,null,null,1]
[null,null,null,null,null,null,null,null,null,null,null,null,"JA= Beim Speichern keinen Blattschutz setzen"]
[null,null,"Email-Adresse der Lohnverrechnung",null,null,null,null,null," Demo ist",null,null,null,"Demomodus beim Speichern nicht beenden"]
[null,null,"lohn@lohn.at",null,null,null,0,0,"AUS"]
[null,null,null,null,null,null,null,null,null,null,null,null,"INTERIMSVARIABLEN"]
[null,"Keine automatische Mittagspausenverbuchung wenn weniger gearbeitet wurde als folgendene Stundenanzahl (z.B. 6,5)",null,null,null,null,6.5,null," Zeiterfassung ohne \n Mittagspausenlogik",null,null,false,"Demomodus aktiv",0]
[null,null,null,null,null,null,null,null,null,null,null,null,"Keine Automatismuswarnung"]
[null,null,null,null,null,null,null,null,null,null,null,null,"(noch leer)"]
[null,"Automatisches Zeitformartieren,  7 wird 7:00, 730 wird 7:30 ... ",null,null,null,null,true,null,"Kontrollsummen \nanzeigen",null,null,false,"IntVar Monatsabschluss",0]
[null,null,null,null,null,null,null,null,null,null,null,null,"Interimvariable alle Tabellen öffnen"]
[]
[null,"Wegzeit in Minuten \n(für Betreten des Arbeitsplatzes bis zum Anmelden)",null,null,null,0,null,null," Zellen mit Formeln nicht\n anwählen können",null,null,null,"Interimsvariable für Update"]
[null,null,null,true,null,true,null,null,null,null,null,true,"Interim I44"]
[null,"Automatisches Speichern \nnach AN/AB-Melden",null,null,"Nach automat. Speichern \ndie Vorlage schließen",null,null,null,"Zeit bis zum automat.Schließen (Sekunden)",null,2,true]
[]
[]
[null,"Tage ohne Zeitbuchung gelten als voll gearbeitet \n(SOLL = IST-Zeit) Standard: KEIN Häkchen setzen !",null,null,null,{"$f":"IF(G29=TRUE,1,0)","v":0},false,null,"IST-h in ROT wenn mehr gearbeitet als:",null,10,true]
[]
[]
[null,"Verprobung der Uhrzeiten mit Internet-Uhrzeit",null,null,null,false,null,null,"Bei Neuanlage fragen ob automatische \nMittagspause gebucht werden soll ",null,null,true]
[]
[null,"Stundensaldo des Vormonats vortragen ins Folgemonat (Standard ist immer JA / Häkchen)",null,null,null,true,null,null,"Bei Neuanlage fragen ob der Stundensaldo \nins Folgemonat vorgetragen werden soll",null,null,false]
[null,"Allg.Urlaubs Anspruch jährlich","Urlaubs Guthaben aus Vorjahr","Urlaubs\nAnspruch in diesem Jahr","Urlaub\nverbraucht in diesem Jahr","Noch offener Urlaub in diesem Jahr","Warnen bei \nÜber schreiten",null,"Frage ob Mittagspause gemacht wurde",null,null,false]
[null,null,null,{"$f":"B36+C36","v":0},{"$f":"Summen!E10","v":0},{"$f":"D36-E36","v":0},false,null,"Warnhinweis bei Erfassen Urlaub und \nKrankenstand an Tagen ohne SOLL-Stunden",null,null,true]
[]
[null,"Max. Stunden laut KV","Karfreitag","frei wählbar","frei wählbar","Heiligabend","Silvester",null,null,null,3]
[null,null,"2019-04-19",null,null,"2017-12-24","2017-12-31",null,null,null,null,null,"JA"]
[]
[]
[]
[]
[null,null,null,null,"Monatsabschluss",null,null,null,null,null,true]
[null,null,null,null,null,null,null,null,null,null,null,null,"1 AKTIV AN 1.STELLE"]
[null,"Übernahme der manuell erfassten Zeiten \n(Spalten X-AA)",null,null,null,null,null,null,null,null,null,2,"2 AKTIV AN 2.STELLE"]
[null,"Positiven Stundensaldo auszahlen",null,true,true,null,null,null,null,null,null,5,"3 AKTIV AN 3.STELLE"]
[null,"Automatisches OK-Setzen \nam letzten Tag im Monat",null,null,null,null,null,null,null,null,null,2,"4 AKTIV AN 4.STELLE"]
["Spalte","Mehr/Überstunden Automatismen",null,null,"Grenzwert","Abgeltung",null,null,"Stundenart und Gültigkeit",null,"Zuschlag (Prozent)","Aktiv und Reihenfolge",null,null,null,null,"Text für Spalten","Liebe Kunden - wir haben unser Bestes getan, um die Mehr- und Überstunden-Ermittlung möglichst korrekt und fehlerfrei zu programmieren. \n\nDennoch können wir keine Haftung für Fehler übernehmen und ersuchen Sie die korrekten Summen nachzuprüfen."]
["K","Tages-Automatismus 1:\nwenn am Tag länger gearbeitet\nwurde als folgende Uhrzeit (später):",null,null,"21:00:00","3 Grund-Stunde ZA - Zuschlag auszahlen",null,null,"Üh    (Überstunde)","2 nur Mo-Fr",100,null,"Auswahlmöglichkeiten in Spalte F\nab Zeile 50",null,"Auswahlmöglichkeiten in Spalte J\nZeile 50+52",null,{"$f":"\">\"&TEXT(E50,\"hh:mm\")&\"   \"&K50&\"% \"&LEFT(I50,5)","v":">21:00   100% Üh   "}]
[null,null,null,null,null,null,null,null,null,null,null,null,"1 Als Zeit- Ausgleich vortragen",null,"1 an allen Tagen"]
["L","Tages-Automatismus 2:\nwenn am Tag länger gearbeitet\nwurde als folgende Uhrzeit (früher):",null,null,"19:30:00","3 Grund-Stunde ZA - Zuschlag auszahlen",null,null,"Üh    (Überstunde)","2 nur Mo-Fr",50,null,"2 Auszahlen",null,"2 nur Mo-Fr",null,{"$f":"\">\"&TEXT(E52,\"hh:mm\")&\"   \"&K52&\"% \"&LEFT(I52,5)","v":">19:30   50% Üh   "}]
[null,null,null,null,null,null,null,null,null,null,null,null,"3 Grund-Stunde ZA - Zuschlag auszahlen",null,"3 nur Mo-Sa"]
["M","Tages-Automatismus 3:\nwenn am Tag mehr gearbeitet\nals folgende Stundenanzahl (länger):",null,null,9,"3 Grund-Stunde ZA - Zuschlag auszahlen",null,null,"Üh    (Überstunde)","2 nur Mo-Fr",50,null,"4 Grund-Stunde auszahlen - Zuschlag ZA",null,"4 nur Sa",null,{"$f":"\">\"&E54&\"h                 \"&K54&\"% \"&LEFT(I54,5)","v":">9h                 50% Üh   "}]
[null,null,null,null,null,null,null,null,null,null,null,null,null,null,"5 nur So+Feiertag"]
["N",{"$f":"IF(E54<>\"\",\"Tages-Automatismus 4: \nwenn mehr als die Tages-Soll-Stunden gearbeitet wurde und weniger als der Grenzwert in Zelle E54: \"&E54&\" Std.\",\"Tages-Automatismus 4: \nwenn mehr als die Tages-Soll-Stunden gearbeitet wurde:\")","v":"Tages-Automatismus 4: \nwenn mehr als die Tages-Soll-Stunden gearbeitet wurde und weniger als der Grenzwert in Zelle E54: 9 Std."},null,null,null,"3 Grund-Stunde ZA - Zuschlag auszahlen",null,null,"Üh    (Überstunde)","2 nur Mo-Fr",50,null,null,null,"6 nur Sa / So / Feiertag",null,{"$f":"\"> Soll-\"&E56&\"h bis \"&E54&\" Std.                    \"&K56&\"% \"&LEFT(I56,5)","v":"> Soll-h bis 9 Std.                    50% Üh   "}]
[]
["O","Sonn-Feiertag-Automatismus:\nSonn- und Feiertags-Überstunden",null,null,null,"3 Grund-Stunde ZA - Zuschlag auszahlen",null,null,"Üh    (Überstunde)",null,100,null,"Auswahlmöglichkeiten Stundentyp",null,"Auswahlmöglichkeiten in Spalte J\nZeile 50+52",null,{"$f":"\"So/Feiert \"&K58&\"% \"&LEFT(I58,5)","v":"So/Feiert 100% Üh   "}]
[null,null,null,null,null,null,null,null,null,null,null,null,"Mh    (Mehrstunde)",null,"1 voll manuell"]
["P","Maximaler Wochenstunden-Automatismus:\nÜberstunden ab der Wochenstunde",null,null,39,"3 Grund-Stunde ZA - Zuschlag auszahlen",null,null,"Üh    (Überstunde)",null,100,null,"Üh    (Überstunde)",null,"2 wenn vor Zeit in      J63 begonnen",null,{"$f":"\">\"&E60&\"h      \"&K60&\"% \"&LEFT(I60,5)","v":">39h      100% Üh   "}]
[null,null,null,null,null,null,null,null,null,null,null,null,"M/Üh (Mehr-o.Überstunde)"]
["Q","Manuelle Erfassung oder Morgengrenzzeit",null,null,null,"3 Grund-Stunde ZA - Zuschlag auszahlen",null,null,"Mh    (Mehrstunde)","1 voll manuell",50,null,null,null,null,null,{"$f":"IF(LEFT(J62,1)=\"1\",\"manuell    \"&K62&\"% \"&LEFT(I62,5),\"Morgens    vor \"&TEXT(J63,\"hh:mm\")&\"    \"&K62&\"% \"&LEFT(I62,5))","v":"manuell    50% Mh   "}]
[null,null,null,null,null,null,null,null,{"$f":"IF(LEFT(J62,1)=\"2\",\"Morgen-Grenzzeit:\",\"\")","v":""},"06:00:00"]
[null,null,null,null,null,null,null,null,null,null,null,1]
[]
[]
[]
["Bewertung mit Dienstplan in Spalten X-AA",null,null,null,"Zuschlag","Uhrzeit",null,null,"Dienstplan Vorschlagswerte\nVormittag von      Vormittag bis            Nachmittag von                  Nachmittag bis                ",null,null,null,null,null,null,null,null,"DP-Vorschlag wenn Klick auf W11",null,null,"Ausweis der Mehr-/Über-Std"]
[null,"Zuschlag vor DP-Beginn",null,null,25,"vor DP\nBeginn",null,"Mo","10:00:00","12:30:00","13:00:00","13:30:00",null,null,null,null,null,null,null,null,"In Stunden"]
[null,"Zuschlag innerhalb DP \nnach 1.Uhrzeit",null,null,50,"19:30:00",null,"Di","11:00:00","12:30:00","13:00:00","14:00:00",null,null,null,null,null,"Vor DP-Vorschlag fragen ob gewollt"]
[null,"Zuschlag innerhalb DP \nnach 2.Uhrzeit",null,null,75,"21:00:00",null,"Mi","12:00:00","13:00:00","13:00:00","15:00:00",null,null,null,null,null,""]
[null,"Zuschlag außerhalb DP \nnach 1.Uhrzeit",null,null,100,{"$f":"F70","v":"19:30:00"},null,"Do","12:30:00","14:00:00","14:00:00","16:00:00",null,null,null,null,null,{"$f":"IF(J74<>L74,\"Achtung - die Wochenstunden-Summe (Zelle D14) stimmt nicht mit dem Dienstplan überein\",\"Keine Differenz - Wochenstunden sind gleich Dienstplan\")","v":"Achtung - die Wochenstunden-Summe (Zelle D14) stimmt nicht mit dem Dienstplan überein"}]
[null,"Zuschlag außerhalb DP \nnach 2.Uhrzeit",null,null,125,"21:00:00",null,"Fr","10:00:00","14:00:00"]
[null,"Zuschlag nach DP-Ende",null,null,150,"nach DP\nEnde",null,null,"Summe Dienstplan:",{"$f":"(J69-I69+L69-K69+J70-I70+L70-K70+J71-I71+L71-K71+J72-I72+L72-K72+J73-I73+L73-K73)*24","v":16},"Wochenstunden:",{"$f":"D13","v":0}]
[]
[]
[]
[]
[]
[]
[null,null," Automatikbuchungen",null,null,null,null,null,null,null,false]
[null,null,"Vormittag",null,"Nachmittag",null,"Kontrolle"]
[null,"Wochentag","von","bis","von","bis","Gesamt",null,"IST-h (D6 bis D12)","Differenz"]
[null,"Montag",null,null,null,null,{"$f":"(F84-E84+D84-C84)*24","v":0},null,{"$f":"D6","v":0},{"$f":"G84-I84","v":0}]
[null,"Dienstag",null,null,null,null,{"$f":"(F85-E85+D85-C85)*24","v":0},null,0,0]
[null,"Mittwoch",null,null,null,null,0,null,0,0]
[null,"Donnerstag",null,null,null,null,0,null,0,0]
[null,"Freitag",null,null,null,null,0,null,0,0]
[null,"Samstag",null,null,null,null,0,null,0,0]
[null,"Sonntag",null,null,null,null,0,null,0,0]
[null,{"$f":"IF(G91<>I91,\"Achtung - Differenz Wochenstunden mit Wochenmodell\",\"\")","v":""},null,null,null,"Summe:",{"$f":"SUM(G84:G90)","v":0},null,{"$f":"SUM(I84:I90)","v":0},0]
[]
[]
[]
[]
[]
[]
[]
[]
[]
[]
[]
[]
[]
[]
[]
[]
[]
[]
[]
[]
[]
[]
[]
[]
[]
[]
[]
[]
[]
[]
[]
[]
[]
[]
[]
[]
[]
[]
[]
[]
[]
[]
[]
[]
[]
[]
[]
[]
[]
[]
[]
[]
[]
[]
[]
[]
[]
[]
[]
[]
[]
[]
[]
[]
[]
[]
[]
[]
[]
[]
[]
[]
[]
[]
[]
[]
[]
[]
[]
[]
[]
[]
[]
[]
[]
[]
[]
[]
[]
[]
[]
[]
[]
[]
[]
[]
[]
[]
[]
[]
[]
[]
[]
[]
[]
[]
[]
[]
[]
[]
[]
[]
[]
[]
[]
[]
[]
[]
[]
[]
[]
[]
[]
[]
[]
[]
[]
[]
[]
[]
[]
[]
[]
[]
[]
[]
[]
[]
[]
[]
[]
[]
[]
[]
[]
[]
[]
[]
[]
[]
[]
[]
[]
[]
[]
[]
[]
[]
[]
[]
[]
[]
[]
[]
[]
[]
[]
[]
[]
[]
[]
[]
[]
[]
[]
[]
[]
[]
[]
[]
[]
[]
[]
[]
[]
[]
[]
[]
[]
[]
[]
[]
[]
[]
[]
[]
[]
[]
[]
[]
[]
[]
[]
[]
[]
[]
[]
[]
[null,"Historie der Wochenmodelle"]

{"sheet":"1 JAN","index":3,"n_rows":49,"n_cols":75,"rows_kept":49,"cut":false,"hidden":false,"merged":[[2,30,2,32],[2,34,2,35],[2,37,2,38],[11,34,11,35],[11,37,11,38],[10,51,12,51],[47,2,47,4],[47,6,47,9],[5,17,7,18],[10,12,12,12],[10,13,12,13],[45,8,45,9],[5,10,5,13],[7,16,8,16],[10,10,12,10],[10,11,12,11],[7,10,8,10],[7,11,8,11],[7,12,8,12],[7,13,8,13],[10,14,12,14],[11,25,11,26],[11,4,11,5],[11,6,11,7],[10,20,12,20],[10,19,12,19],[11,17,11,18],[10,50,12,50],[10,42,12,42],[10,43,12,43],[10,44,12,44],[10,45,12,45],[10,46,12,46],[10,47,12,47],[10,48,12,48],[10,49,12,49],[0,22,0,26],[8,26,9,26],[5,22,5,24],[10,22,10,26],[6,26,7,26],[46,6,46,16],[47,10,47,13],[45,19,45,21],[46,19,46,21],[5,27,6,27],[5,5,5,8],[10,8,11,9],[10,4,10,7],[8,17,8,18],[7,15,8,15],[8,4,8,8],[7,14,8,14],[10,16,12,16],[10,15,12,15],[5,16,6,16],[46,2,46,4],[2,2,2,18],[7,4,7,8],[8,2,8,3],[7,2,7,3],[10,3,11,3],[10,2,11,2],[5,2,5,4],[48,2,48,3],[48,4,48,9],[11,22,12,22],[11,23,11,24],[47,22,47,24],[44,19,44,20],[48,17,48,18],[48,19,48,21],[48,22,48,24],[46,22,46,24],[45,22,45,24],[47,14,47,16],[47,17,47,18],[46,17,46,18],[45,17,45,18],[47,19,47,21],[2,74,11,74],[2,69,11,69],[2,70,11,70],[2,71,11,71],[2,72,11,72],[2,73,11,73]]}
[]
[null,null,null,null,null,null,{"$f":"YEAR(MonatsErster)","v":2020}]
[null,null,null,null,null,null,null,null,null,null,null,null,null,null,null,null,null,null,null,null,null,null,null,null,null,null,null,null,null,null,null,null,null,null,null,null,null,null,null,null,null,null,null,null,null,null,null,null,null,null,null,null,null,null,null,null,null,null,null,null,null,null,null,null,null,null,null,null,null,{"$f":"IF(AND(Parameter!E69<>\"\"),Parameter!B69&\" \"&Parameter!E69&\"%\",\"\")","v":"Zuschlag vor DP-Beginn 25%"},{"$f":"IF(AND(Parameter!E70<>\"\",Parameter!F70<>\"\"),Parameter!B70&\" \"&TEXT(Parameter!F70,\"hh:mm\")&\" \"&Parameter!E70&\"%\",\"\")","v":"Zuschlag innerhalb DP \nnach 1.Uhrzeit 19:30 50%"},{"$f":"IF(AND(Parameter!E71<>\"\",Parameter!F71<>\"\"),Parameter!B71&\" \"&TEXT(Parameter!F71,\"hh:mm\")&\" \"&Parameter!E71&\"%\",\"\")","v":"Zuschlag innerhalb DP \nnach 2.Uhrzeit 21:00 75%"},{"$f":"IF(AND(Parameter!E72<>\"\",Parameter!F72<>\"\"),Parameter!B72&\" \"&TEXT(Parameter!F72,\"hh:mm\")&\" \"&Parameter!E72&\"%\",\"\")","v":"Zuschlag außerhalb DP \nnach 1.Uhrzeit 19:30 100%"},{"$f":"IF(AND(Parameter!E73<>\"\",Parameter!F73<>\"\"),Parameter!B73&\" \"&TEXT(Parameter!F73,\"hh:mm\")&\" \"&Parameter!E73&\"%\",\"\")","v":"Zuschlag außerhalb DP \nnach 2.Uhrzeit 21:00 125%"},{"$f":"IF(AND(Parameter!B74<>\"\"),Parameter!B74&\" \"&Parameter!E74&\"%\",\"\")","v":"Zuschlag nach DP-Ende 150%"}]
[]
[]
[null,null,"Monat",null,null,"2020-01-01",null,null,null,null,"täglich",null,null,null,"So/Feier","Woche",{"$f":"IF(LEFT(Parameter!J62,1)=\"1\",\"Manuell\",\"Morgen Zeit\")","v":"Manuell"},"Vortrag aus\n Vorjahr"]
[]
[null,null,"MitarbeitNr.",null,null,null,null,null,null,null,{"$f":"Parameter!Q50","v":">21:00   100% Üh   "},{"$f":"Parameter!Q52","v":">19:30   50% Üh   "},{"$f":"Parameter!Q54","v":">9h                 50% Üh   "},{"$f":"Parameter!Q56","v":"> Soll-h bis 9 Std.                    50% Üh   "},{"$f":"Parameter!Q58","v":"So/Feiert 100% Üh   "},{"$f":"Parameter!Q60","v":">39h      100% Üh   "},{"$f":"Parameter!Q62","v":"manuell    50% Mh   "}]
[null,null,"Name:"]
[null,null,null,{"$f":"IF(D16=\"Fr\",\"JA\",\"\")","v":""}]
[null,null,"Datum","Tag","tatsächliche Arbeitszeit",null,null,null," Gesamt\nStunden",null,{"$f":"MID(Parameter!F50,3,99)","v":"Grund-Stunde ZA - Zuschlag auszahlen"},{"$f":"MID(Parameter!F52,3,99)","v":"Grund-Stunde ZA - Zuschlag auszahlen"},{"$f":"MID(Parameter!F54,3,99)","v":"Grund-Stunde ZA - Zuschlag auszahlen"},{"$f":"MID(Parameter!F56,3,99)","v":"Grund-Stunde ZA - Zuschlag auszahlen"},{"$f":"MID(Parameter!F58,3,99)","v":"Grund-Stunde ZA - Zuschlag auszahlen"},{"$f":"MID(Parameter!F60,3,99)","v":"Grund-Stunde ZA - Zuschlag auszahlen"},{"$f":"MID(Parameter!F62,3,99)","v":"Grund-Stunde ZA - Zuschlag auszahlen"},"Gut-","Minus-"," Urlaub\nKrank\n\nU oder K \nmachen","Feiertag\n\nF-ix\nB-ewegl.",null,{"$f":"IF(AND(UPPER(Parameter!G68=\"AKTIV\"),UPPER(Parameter!R69=\"AKTIV\")),\"Dienstplan-Vorschlag übernehmen\",IF(UPPER(Parameter!G68=\"AKTIV\"),\"Dienstplan\",\"Manuelle Zeiterfassung\"))","v":"Manuelle Zeiterfassung"},null,null,null,null,null,null,null,null,null,null,null,null,null,null,null,null,null,null,null,"Aktueller\nTages\nSaldo","Summe Grundstunden\nim Zeitsaldo","Summe \nZuschlag \nZeitsaldo \nerhöhend","Summe Grundstunden\nzur Auszahlung","Summe \nZuschlag\nzur Auszahlung","Korrigierter Tagessaldo","Korrigierte \nTages IST-Std","Differenz SOLL-Std zu IST-Std inkl. Zeitsaldo Korrekturen","Tagesstunden + sonntags Summe Wochen-\nStunden","Wochen\nsumme \n(korrigiert)"]
[null,null,null,null,"Vormittag",null,"Nachmittag",null,null,null,null,null,null,null,null,null,null,"Stunden",null,null,null,null,{"$f":"IF(UPPER(Parameter!G68)=\"AKTIV\",\"Manuelle Zeiten in Spalte W sind monatlich manuell in die Spalten E-H zu übernehmen\",\"Begründung manuelle Zeiterfassung\")","v":"Begründung manuelle Zeiterfassung"},"Vormittag",null,"Nachmittag"]
[null,"OK",null,null,"von","bis","von","bis","Ist","Soll",null,null,null,null,null,null,null,"+","-",null,null,null,null,"von","bis","von","bis",null,null,null,"Anmerkung","Internet AN Vorm.","Differenz","Anzahl Internetzeiten","Internet AB Vorm","Differenz","Internet AN Nachm.","Differenz","Internet AB Nachm.","Differenz",null,null,null,null,null,null,null,null,null,null,null,null,null,null,null,null,null,null,null,null,null,null,null,null,null,null,null,null,null,{"$f":"SUM(BR14:BR44)","v":0},0,0,0,0,0]
[null,null,{"$f":"MonatsErster","v":"2020-01-01"},{"$f":"C14","v":"2020-01-01"},null,null,null,null,{"$f":"IF(LEN(F14)+LEN(H14)>0,IF(LEN(H14)>0,(HOUR(F14-E14)+MINUTE(F14-E14)/60)+(HOUR(H14-G14)+MINUTE(H14-G14)/60),(HOUR(F14-E14)+MINUTE(F14-E14)/60)),IF(Parameter!$F$29=1,J14,IF(T14=\"\",0,J14)))","v":0},null,null,null,null,null,null,null,null,{"$f":"IF(I14>J14,I14-J14,0)","v":0},{"$f":"IF(C14<=TODAY(),IF(I14<J14,J14-I14,0),0)","v":0},null,"F",null,null,null,null,null,null,null,null,null,null,null,{"$f":"IF(AF14<>\"\",IF(E14<>\"\",ABS(24*60*(E14-AF14)),ABS(24*60*(G14-AF14))),0)","v":0},{"$f":"COUNTA(AF14,AI14,AK14,AM14)","v":0},null,{"$f":"IF(AI14<>\"\",IF(H14<>\"\",ABS(24*60*(H14-AI14)),ABS(24*60*(F14-AI14))),0)","v":0},null,{"$f":"IF(AK14<>\"\",IF(E14<>\"\",ABS(24*60*(E14-AK14)),ABS(24*60*(G14-AK14))),0)","v":0},null,{"$f":"IF(AM14<>\"\",IF(H14<>\"\",ABS(24*60*(H14-AM14)),ABS(24*60*(F14-AM14))),0)","v":0},null,null,{"$f":"R9+R14-S14","v":0}]
[null,null,{"$f":"IF(MONTH(C14+1)>MONTH(C14),\"\",C14+1)","v":"2020-01-02"},{"$f":"C15","v":"2020-01-02"},null,null,null,null,{"$f":"IF(LEN(F15)+LEN(H15)>0,IF(LEN(H15)>0,(HOUR(F15-E15)+MINUTE(F15-E15)/60)+(HOUR(H15-G15)+MINUTE(H15-G15)/60),(HOUR(F15-E15)+MINUTE(F15-E15)/60)),IF(Parameter!$F$29=1,J15,IF(T15=\"\",0,J15)))","v":0},null,null,null,null,null,null,null,null,{"$f":"IF(I15>J15,I15-J15,0)","v":0},{"$f":"IF(C15<=TODAY(),IF(I15<J15,J15-I15,0),0)","v":0},null,null,null,null,null,null,null,null,null,null,null,null,null,{"$f":"IF(AF15<>\"\",IF(E15<>\"\",ABS(24*60*(E15-AF15)),ABS(24*60*(G15-AF15))),0)","v":0},{"$f":"COUNTA(AF15,AI15,AK15,AM15)","v":0},null,{"$f":"IF(AI15<>\"\",IF(H15<>\"\",ABS(24*60*(H15-AI15)),ABS(24*60*(F15-AI15))),0)","v":0},null,{"$f":"IF(AK15<>\"\",IF(E15<>\"\",ABS(24*60*(E15-AK15)),ABS(24*60*(G15-AK15))),0)","v":0},null,{"$f":"IF(AM15<>\"\",IF(H15<>\"\",ABS(24*60*(H15-AM15)),ABS(24*60*(F15-AM15))),0)","v":0},null,null,{"$f":"AQ14+R15-S15","v":0}]
[null,null,{"$f":"IF(MONTH(C15+1)>MONTH(C15),\"\",C15+1)","v":"2020-01-03"},"2020-01-03",null,null,null,null,{"$f":"IF(LEN(F16)+LEN(H16)>0,IF(LEN(H16)>0,(HOUR(F16-E16)+MINUTE(F16-E16)/60)+(HOUR(H16-G16)+MINUTE(H16-G16)/60),(HOUR(F16-E16)+MINUTE(F16-E16)/60)),IF(Parameter!$F$29=1,J16,IF(T16=\"\",0,J16)))","v":0},null,null,null,null,null,null,null,null,{"$f":"IF(I16>J16,I16-J16,0)","v":0},{"$f":"IF(C16<=TODAY(),IF(I16<J16,J16-I16,0),0)","v":0},null,null,null,null,null,null,null,null,null,null,null,null,null,{"$f":"IF(AF16<>\"\",IF(E16<>\"\",ABS(24*60*(E16-AF16)),ABS(24*60*(G16-AF16))),0)","v":0},{"$f":"COUNTA(AF16,AI16,AK16,AM16)","v":0},null,{"$f":"IF(AI16<>\"\",IF(H16<>\"\",ABS(24*60*(H16-AI16)),ABS(24*60*(F16-AI16))),0)","v":0},null,{"$f":"IF(AK16<>\"\",IF(E16<>\"\",ABS(24*60*(E16-AK16)),ABS(24*60*(G16-AK16))),0)","v":0},null,{"$f":"IF(AM16<>\"\",IF(H16<>\"\",ABS(24*60*(H16-AM16)),ABS(24*60*(F16-AM16))),0)","v":0},null,null,{"$f":"AQ15+R16-S16","v":0}]
[null,null,"2020-01-04","2020-01-04",null,null,null,null,{"$f":"IF(LEN(F17)+LEN(H17)>0,IF(LEN(H17)>0,(HOUR(F17-E17)+MINUTE(F17-E17)/60)+(HOUR(H17-G17)+MINUTE(H17-G17)/60),(HOUR(F17-E17)+MINUTE(F17-E17)/60)),IF(Parameter!$F$29=1,J17,IF(T17=\"\",0,J17)))","v":0},null,null,null,null,null,null,null,null,{"$f":"IF(I17>J17,I17-J17,0)","v":0},{"$f":"IF(C17<=TODAY(),IF(I17<J17,J17-I17,0),0)","v":0},null,null,null,null,null,null,null,null,null,null,null,null,null,{"$f":"IF(AF17<>\"\",IF(E17<>\"\",ABS(24*60*(E17-AF17)),ABS(24*60*(G17-AF17))),0)","v":0},{"$f":"COUNTA(AF17,AI17,AK17,AM17)","v":0},null,{"$f":"IF(AI17<>\"\",IF(H17<>\"\",ABS(24*60*(H17-AI17)),ABS(24*60*(F17-AI17))),0)","v":0},null,{"$f":"IF(AK17<>\"\",IF(E17<>\"\",ABS(24*60*(E17-AK17)),ABS(24*60*(G17-AK17))),0)","v":0},null,{"$f":"IF(AM17<>\"\",IF(H17<>\"\",ABS(24*60*(H17-AM17)),ABS(24*60*(F17-AM17))),0)","v":0},null,null,{"$f":"AQ16+R17-S17","v":0}]
[null,null,"2020-01-05","2020-01-05",null,null,null,null,{"$f":"IF(LEN(F18)+LEN(H18)>0,IF(LEN(H18)>0,(HOUR(F18-E18)+MINUTE(F18-E18)/60)+(HOUR(H18-G18)+MINUTE(H18-G18)/60),(HOUR(F18-E18)+MINUTE(F18-E18)/60)),IF(Parameter!$F$29=1,J18,IF(T18=\"\",0,J18)))","v":0},null,null,null,null,null,null,null,null,{"$f":"IF(I18>J18,I18-J18,0)","v":0},{"$f":"IF(C18<=TODAY(),IF(I18<J18,J18-I18,0),0)","v":0},null,null,null,null,null,null,null,null,null,null,null,null,null,{"$f":"IF(AF18<>\"\",IF(E18<>\"\",ABS(24*60*(E18-AF18)),ABS(24*60*(G18-AF18))),0)","v":0},{"$f":"COUNTA(AF18,AI18,AK18,AM18)","v":0},null,{"$f":"IF(AI18<>\"\",IF(H18<>\"\",ABS(24*60*(H18-AI18)),ABS(24*60*(F18-AI18))),0)","v":0},null,{"$f":"IF(AK18<>\"\",IF(E18<>\"\",ABS(24*60*(E18-AK18)),ABS(24*60*(G18-AK18))),0)","v":0},null,{"$f":"IF(AM18<>\"\",IF(H18<>\"\",ABS(24*60*(H18-AM18)),ABS(24*60*(F18-AM18))),0)","v":0},null,null,{"$f":"AQ17+R18-S18","v":0}]
[null,null,"2020-01-06","2020-01-06",null,null,null,null,{"$f":"IF(LEN(F19)+LEN(H19)>0,IF(LEN(H19)>0,(HOUR(F19-E19)+MINUTE(F19-E19)/60)+(HOUR(H19-G19)+MINUTE(H19-G19)/60),(HOUR(F19-E19)+MINUTE(F19-E19)/60)),IF(Parameter!$F$29=1,J19,IF(T19=\"\",0,J19)))","v":0},null,null,null,null,null,null,null,null,{"$f":"IF(I19>J19,I19-J19,0)","v":0},{"$f":"IF(C19<=TODAY(),IF(I19<J19,J19-I19,0),0)","v":0},null,"F",null,null,null,null,null,null,null,null,null,null,null,{"$f":"IF(AF19<>\"\",IF(E19<>\"\",ABS(24*60*(E19-AF19)),ABS(24*60*(G19-AF19))),0)","v":0},{"$f":"COUNTA(AF19,AI19,AK19,AM19)","v":0},null,{"$f":"IF(AI19<>\"\",IF(H19<>\"\",ABS(24*60*(H19-AI19)),ABS(24*60*(F19-AI19))),0)","v":0},null,{"$f":"IF(AK19<>\"\",IF(E19<>\"\",ABS(24*60*(E19-AK19)),ABS(24*60*(G19-AK19))),0)","v":0},null,{"$f":"IF(AM19<>\"\",IF(H19<>\"\",ABS(24*60*(H19-AM19)),ABS(24*60*(F19-AM19))),0)","v":0},null,null,{"$f":"AQ18+R19-S19","v":0}]
[null,null,"2020-01-07","2020-01-07",null,null,null,null,{"$f":"IF(LEN(F20)+LEN(H20)>0,IF(LEN(H20)>0,(HOUR(F20-E20)+MINUTE(F20-E20)/60)+(HOUR(H20-G20)+MINUTE(H20-G20)/60),(HOUR(F20-E20)+MINUTE(F20-E20)/60)),IF(Parameter!$F$29=1,J20,IF(T20=\"\",0,J20)))","v":0},null,null,null,null,null,null,null,null,{"$f":"IF(I20>J20,I20-J20,0)","v":0},{"$f":"IF(C20<=TODAY(),IF(I20<J20,J20-I20,0),0)","v":0},null,null,null,null,null,null,null,null,null,null,null,null,null,{"$f":"IF(AF20<>\"\",IF(E20<>\"\",ABS(24*60*(E20-AF20)),ABS(24*60*(G20-AF20))),0)","v":0},{"$f":"COUNTA(AF20,AI20,AK20,AM20)","v":0},null,{"$f":"IF(AI20<>\"\",IF(H20<>\"\",ABS(24*60*(H20-AI20)),ABS(24*60*(F20-AI20))),0)","v":0},null,{"$f":"IF(AK20<>\"\",IF(E20<>\"\",ABS(24*60*(E20-AK20)),ABS(24*60*(G20-AK20))),0)","v":0},null,{"$f":"IF(AM20<>\"\",IF(H20<>\"\",ABS(24*60*(H20-AM20)),ABS(24*60*(F20-AM20))),0)","v":0},null,null,{"$f":"AQ19+R20-S20","v":0}]
[null,null,"2020-01-08","2020-01-08",null,null,null,null,{"$f":"IF(LEN(F21)+LEN(H21)>0,IF(LEN(H21)>0,(HOUR(F21-E21)+MINUTE(F21-E21)/60)+(HOUR(H21-G21)+MINUTE(H21-G21)/60),(HOUR(F21-E21)+MINUTE(F21-E21)/60)),IF(Parameter!$F$29=1,J21,IF(T21=\"\",0,J21)))","v":0},null,null,null,null,null,null,null,null,{"$f":"IF(I21>J21,I21-J21,0)","v":0},{"$f":"IF(C21<=TODAY(),IF(I21<J21,J21-I21,0),0)","v":0},null,null,null,null,null,null,null,null,null,null,null,null,null,{"$f":"IF(AF21<>\"\",IF(E21<>\"\",ABS(24*60*(E21-AF21)),ABS(24*60*(G21-AF21))),0)","v":0},{"$f":"COUNTA(AF21,AI21,AK21,AM21)","v":0},null,{"$f":"IF(AI21<>\"\",IF(H21<>\"\",ABS(24*60*(H21-AI21)),ABS(24*60*(F21-AI21))),0)","v":0},null,{"$f":"IF(AK21<>\"\",IF(E21<>\"\",ABS(24*60*(E21-AK21)),ABS(24*60*(G21-AK21))),0)","v":0},null,{"$f":"IF(AM21<>\"\",IF(H21<>\"\",ABS(24*60*(H21-AM21)),ABS(24*60*(F21-AM21))),0)","v":0},null,null,{"$f":"AQ20+R21-S21","v":0}]
[null,null,"2020-01-09","2020-01-09",null,null,null,null,{"$f":"IF(LEN(F22)+LEN(H22)>0,IF(LEN(H22)>0,(HOUR(F22-E22)+MINUTE(F22-E22)/60)+(HOUR(H22-G22)+MINUTE(H22-G22)/60),(HOUR(F22-E22)+MINUTE(F22-E22)/60)),IF(Parameter!$F$29=1,J22,IF(T22=\"\",0,J22)))","v":0},null,null,null,null,null,null,null,null,{"$f":"IF(I22>J22,I22-J22,0)","v":0},{"$f":"IF(C22<=TODAY(),IF(I22<J22,J22-I22,0),0)","v":0},null,null,null,null,null,null,null,null,null,null,null,null,null,{"$f":"IF(AF22<>\"\",IF(E22<>\"\",ABS(24*60*(E22-AF22)),ABS(24*60*(G22-AF22))),0)","v":0},{"$f":"COUNTA(AF22,AI22,AK22,AM22)","v":0},null,{"$f":"IF(AI22<>\"\",IF(H22<>\"\",ABS(24*60*(H22-AI22)),ABS(24*60*(F22-AI22))),0)","v":0},null,{"$f":"IF(AK22<>\"\",IF(E22<>\"\",ABS(24*60*(E22-AK22)),ABS(24*60*(G22-AK22))),0)","v":0},null,{"$f":"IF(AM22<>\"\",IF(H22<>\"\",ABS(24*60*(H22-AM22)),ABS(24*60*(F22-AM22))),0)","v":0},null,null,{"$f":"AQ21+R22-S22","v":0}]
[null,null,"2020-01-10","2020-01-10",null,null,null,null,{"$f":"IF(LEN(F23)+LEN(H23)>0,IF(LEN(H23)>0,(HOUR(F23-E23)+MINUTE(F23-E23)/60)+(HOUR(H23-G23)+MINUTE(H23-G23)/60),(HOUR(F23-E23)+MINUTE(F23-E23)/60)),IF(Parameter!$F$29=1,J23,IF(T23=\"\",0,J23)))","v":0},null,null,null,null,null,null,null,null,{"$f":"IF(I23>J23,I23-J23,0)","v":0},{"$f":"IF(C23<=TODAY(),IF(I23<J23,J23-I23,0),0)","v":0},null,null,null,null,null,null,null,null,null,null,null,null,null,{"$f":"IF(AF23<>\"\",IF(E23<>\"\",ABS(24*60*(E23-AF23)),ABS(24*60*(G23-AF23))),0)","v":0},{"$f":"COUNTA(AF23,AI23,AK23,AM23)","v":0},null,{"$f":"IF(AI23<>\"\",IF(H23<>\"\",ABS(24*60*(H23-AI23)),ABS(24*60*(F23-AI23))),0)","v":0},null,{"$f":"IF(AK23<>\"\",IF(E23<>\"\",ABS(24*60*(E23-AK23)),ABS(24*60*(G23-AK23))),0)","v":0},null,{"$f":"IF(AM23<>\"\",IF(H23<>\"\",ABS(24*60*(H23-AM23)),ABS(24*60*(F23-AM23))),0)","v":0},null,null,{"$f":"AQ22+R23-S23","v":0}]
[null,null,"2020-01-11","2020-01-11",null,null,null,null,{"$f":"IF(LEN(F24)+LEN(H24)>0,IF(LEN(H24)>0,(HOUR(F24-E24)+MINUTE(F24-E24)/60)+(HOUR(H24-G24)+MINUTE(H24-G24)/60),(HOUR(F24-E24)+MINUTE(F24-E24)/60)),IF(Parameter!$F$29=1,J24,IF(T24=\"\",0,J24)))","v":0},null,null,null,null,null,null,null,null,{"$f":"IF(I24>J24,I24-J24,0)","v":0},{"$f":"IF(C24<=TODAY(),IF(I24<J24,J24-I24,0),0)","v":0},null,null,null,null,null,null,null,null,null,null,null,null,null,{"$f":"IF(AF24<>\"\",IF(E24<>\"\",ABS(24*60*(E24-AF24)),ABS(24*60*(G24-AF24))),0)","v":0},{"$f":"COUNTA(AF24,AI24,AK24,AM24)","v":0},null,{"$f":"IF(AI24<>\"\",IF(H24<>\"\",ABS(24*60*(H24-AI24)),ABS(24*60*(F24-AI24))),0)","v":0},null,{"$f":"IF(AK24<>\"\",IF(E24<>\"\",ABS(24*60*(E24-AK24)),ABS(24*60*(G24-AK24))),0)","v":0},null,{"$f":"IF(AM24<>\"\",IF(H24<>\"\",ABS(24*60*(H24-AM24)),ABS(24*60*(F24-AM24))),0)","v":0},null,null,{"$f":"AQ23+R24-S24","v":0}]
[null,null,"2020-01-12","2020-01-12",null,null,null,null,{"$f":"IF(LEN(F25)+LEN(H25)>0,IF(LEN(H25)>0,(HOUR(F25-E25)+MINUTE(F25-E25)/60)+(HOUR(H25-G25)+MINUTE(H25-G25)/60),(HOUR(F25-E25)+MINUTE(F25-E25)/60)),IF(Parameter!$F$29=1,J25,IF(T25=\"\",0,J25)))","v":0},null,null,null,null,null,null,null,null,{"$f":"IF(I25>J25,I25-J25,0)","v":0},{"$f":"IF(C25<=TODAY(),IF(I25<J25,J25-I25,0),0)","v":0},null,null,null,null,null,null,null,null,null,null,null,null,null,{"$f":"IF(AF25<>\"\",IF(E25<>\"\",ABS(24*60*(E25-AF25)),ABS(24*60*(G25-AF25))),0)","v":0},{"$f":"COUNTA(AF25,AI25,AK25,AM25)","v":0},null,{"$f":"IF(AI25<>\"\",IF(H25<>\"\",ABS(24*60*(H25-AI25)),ABS(24*60*(F25-AI25))),0)","v":0},null,{"$f":"IF(AK25<>\"\",IF(E25<>\"\",ABS(24*60*(E25-AK25)),ABS(24*60*(G25-AK25))),0)","v":0},null,{"$f":"IF(AM25<>\"\",IF(H25<>\"\",ABS(24*60*(H25-AM25)),ABS(24*60*(F25-AM25))),0)","v":0},null,null,{"$f":"AQ24+R25-S25","v":0}]
[null,null,"2020-01-13","2020-01-13",null,null,null,null,{"$f":"IF(LEN(F26)+LEN(H26)>0,IF(LEN(H26)>0,(HOUR(F26-E26)+MINUTE(F26-E26)/60)+(HOUR(H26-G26)+MINUTE(H26-G26)/60),(HOUR(F26-E26)+MINUTE(F26-E26)/60)),IF(Parameter!$F$29=1,J26,IF(T26=\"\",0,J26)))","v":0},null,null,null,null,null,null,null,null,{"$f":"IF(I26>J26,I26-J26,0)","v":0},{"$f":"IF(C26<=TODAY(),IF(I26<J26,J26-I26,0),0)","v":0},null,null,null,null,null,null,null,null,null,null,null,null,null,{"$f":"IF(AF26<>\"\",IF(E26<>\"\",ABS(24*60*(E26-AF26)),ABS(24*60*(G26-AF26))),0)","v":0},{"$f":"COUNTA(AF26,AI26,AK26,AM26)","v":0},null,{"$f":"IF(AI26<>\"\",IF(H26<>\"\",ABS(24*60*(H26-AI26)),ABS(24*60*(F26-AI26))),0)","v":0},null,{"$f":"IF(AK26<>\"\",IF(E26<>\"\",ABS(24*60*(E26-AK26)),ABS(24*60*(G26-AK26))),0)","v":0},null,{"$f":"IF(AM26<>\"\",IF(H26<>\"\",ABS(24*60*(H26-AM26)),ABS(24*60*(F26-AM26))),0)","v":0},null,null,{"$f":"AQ25+R26-S26","v":0}]
[null,null,"2020-01-14","2020-01-14",null,null,null,null,{"$f":"IF(LEN(F27)+LEN(H27)>0,IF(LEN(H27)>0,(HOUR(F27-E27)+MINUTE(F27-E27)/60)+(HOUR(H27-G27)+MINUTE(H27-G27)/60),(HOUR(F27-E27)+MINUTE(F27-E27)/60)),IF(Parameter!$F$29=1,J27,IF(T27=\"\",0,J27)))","v":0},null,null,null,null,null,null,null,null,{"$f":"IF(I27>J27,I27-J27,0)","v":0},{"$f":"IF(C27<=TODAY(),IF(I27<J27,J27-I27,0),0)","v":0},null,null,null,null,null,null,null,null,null,null,null,null,null,{"$f":"IF(AF27<>\"\",IF(E27<>\"\",ABS(24*60*(E27-AF27)),ABS(24*60*(G27-AF27))),0)","v":0},{"$f":"COUNTA(AF27,AI27,AK27,AM27)","v":0},null,{"$f":"IF(AI27<>\"\",IF(H27<>\"\",ABS(24*60*(H27-AI27)),ABS(24*60*(F27-AI27))),0)","v":0},null,{"$f":"IF(AK27<>\"\",IF(E27<>\"\",ABS(24*60*(E27-AK27)),ABS(24*60*(G27-AK27))),0)","v":0},null,{"$f":"IF(AM27<>\"\",IF(H27<>\"\",ABS(24*60*(H27-AM27)),ABS(24*60*(F27-AM27))),0)","v":0},null,null,{"$f":"AQ26+R27-S27","v":0}]
[null,null,"2020-01-15","2020-01-15",null,null,null,null,{"$f":"IF(LEN(F28)+LEN(H28)>0,IF(LEN(H28)>0,(HOUR(F28-E28)+MINUTE(F28-E28)/60)+(HOUR(H28-G28)+MINUTE(H28-G28)/60),(HOUR(F28-E28)+MINUTE(F28-E28)/60)),IF(Parameter!$F$29=1,J28,IF(T28=\"\",0,J28)))","v":0},null,null,null,null,null,null,null,null,{"$f":"IF(I28>J28,I28-J28,0)","v":0},{"$f":"IF(C28<=TODAY(),IF(I28<J28,J28-I28,0),0)","v":0},null,null,null,null,null,null,null,null,null,null,null,null,null,{"$f":"IF(AF28<>\"\",IF(E28<>\"\",ABS(24*60*(E28-AF28)),ABS(24*60*(G28-AF28))),0)","v":0},{"$f":"COUNTA(AF28,AI28,AK28,AM28)","v":0},null,{"$f":"IF(AI28<>\"\",IF(H28<>\"\",ABS(24*60*(H28-AI28)),ABS(24*60*(F28-AI28))),0)","v":0},null,{"$f":"IF(AK28<>\"\",IF(E28<>\"\",ABS(24*60*(E28-AK28)),ABS(24*60*(G28-AK28))),0)","v":0},null,{"$f":"IF(AM28<>\"\",IF(H28<>\"\",ABS(24*60*(H28-AM28)),ABS(24*60*(F28-AM28))),0)","v":0},null,null,{"$f":"AQ27+R28-S28","v":0}]
[null,null,"2020-01-16","2020-01-16",null,null,null,null,{"$f":"IF(LEN(F29)+LEN(H29)>0,IF(LEN(H29)>0,(HOUR(F29-E29)+MINUTE(F29-E29)/60)+(HOUR(H29-G29)+MINUTE(H29-G29)/60),(HOUR(F29-E29)+MINUTE(F29-E29)/60)),IF(Parameter!$F$29=1,J29,IF(T29=\"\",0,J29)))","v":0},null,null,null,null,null,null,null,null,{"$f":"IF(I29>J29,I29-J29,0)","v":0},{"$f":"IF(C29<=TODAY(),IF(I29<J29,J29-I29,0),0)","v":0},null,null,null,null,null,null,null,null,null,null,null,null,null,{"$f":"IF(AF29<>\"\",IF(E29<>\"\",ABS(24*60*(E29-AF29)),ABS(24*60*(G29-AF29))),0)","v":0},{"$f":"COUNTA(AF29,AI29,AK29,AM29)","v":0},null,{"$f":"IF(AI29<>\"\",IF(H29<>\"\",ABS(24*60*(H29-AI29)),ABS(24*60*(F29-AI29))),0)","v":0},null,{"$f":"IF(AK29<>\"\",IF(E29<>\"\",ABS(24*60*(E29-AK29)),ABS(24*60*(G29-AK29))),0)","v":0},null,{"$f":"IF(AM29<>\"\",IF(H29<>\"\",ABS(24*60*(H29-AM29)),ABS(24*60*(F29-AM29))),0)","v":0},null,null,{"$f":"AQ28+R29-S29","v":0}]
[null,null,"2020-01-17","2020-01-17",null,null,null,null,{"$f":"IF(LEN(F30)+LEN(H30)>0,IF(LEN(H30)>0,(HOUR(F30-E30)+MINUTE(F30-E30)/60)+(HOUR(H30-G30)+MINUTE(H30-G30)/60),(HOUR(F30-E30)+MINUTE(F30-E30)/60)),IF(Parameter!$F$29=1,J30,IF(T30=\"\",0,J30)))","v":0},null,null,null,null,null,null,null,null,{"$f":"IF(I30>J30,I30-J30,0)","v":0},{"$f":"IF(C30<=TODAY(),IF(I30<J30,J30-I30,0),0)","v":0},null,null,null,null,null,null,null,null,null,null,null,null,null,{"$f":"IF(AF30<>\"\",IF(E30<>\"\",ABS(24*60*(E30-AF30)),ABS(24*60*(G30-AF30))),0)","v":0},{"$f":"COUNTA(AF30,AI30,AK30,AM30)","v":0},null,{"$f":"IF(AI30<>\"\",IF(H30<>\"\",ABS(24*60*(H30-AI30)),ABS(24*60*(F30-AI30))),0)","v":0},null,{"$f":"IF(AK30<>\"\",IF(E30<>\"\",ABS(24*60*(E30-AK30)),ABS(24*60*(G30-AK30))),0)","v":0},null,{"$f":"IF(AM30<>\"\",IF(H30<>\"\",ABS(24*60*(H30-AM30)),ABS(24*60*(F30-AM30))),0)","v":0},null,null,{"$f":"AQ29+R30-S30","v":0}]
[null,null,"2020-01-18","2020-01-18",null,null,null,null,{"$f":"IF(LEN(F31)+LEN(H31)>0,IF(LEN(H31)>0,(HOUR(F31-E31)+MINUTE(F31-E31)/60)+(HOUR(H31-G31)+MINUTE(H31-G31)/60),(HOUR(F31-E31)+MINUTE(F31-E31)/60)),IF(Parameter!$F$29=1,J31,IF(T31=\"\",0,J31)))","v":0},null,null,null,null,null,null,null,null,{"$f":"IF(I31>J31,I31-J31,0)","v":0},{"$f":"IF(C31<=TODAY(),IF(I31<J31,J31-I31,0),0)","v":0},null,null,null,null,null,null,null,null,null,null,null,null,null,{"$f":"IF(AF31<>\"\",IF(E31<>\"\",ABS(24*60*(E31-AF31)),ABS(24*60*(G31-AF31))),0)","v":0},{"$f":"COUNTA(AF31,AI31,AK31,AM31)","v":0},null,{"$f":"IF(AI31<>\"\",IF(H31<>\"\",ABS(24*60*(H31-AI31)),ABS(24*60*(F31-AI31))),0)","v":0},null,{"$f":"IF(AK31<>\"\",IF(E31<>\"\",ABS(24*60*(E31-AK31)),ABS(24*60*(G31-AK31))),0)","v":0},null,{"$f":"IF(AM31<>\"\",IF(H31<>\"\",ABS(24*60*(H31-AM31)),ABS(24*60*(F31-AM31))),0)","v":0},null,null,{"$f":"AQ30+R31-S31","v":0}]
[null,null,"2020-01-19","2020-01-19",null,null,null,null,{"$f":"IF(LEN(F32)+LEN(H32)>0,IF(LEN(H32)>0,(HOUR(F32-E32)+MINUTE(F32-E32)/60)+(HOUR(H32-G32)+MINUTE(H32-G32)/60),(HOUR(F32-E32)+MINUTE(F32-E32)/60)),IF(Parameter!$F$29=1,J32,IF(T32=\"\",0,J32)))","v":0},null,null,null,null,null,null,null,null,{"$f":"IF(I32>J32,I32-J32,0)","v":0},{"$f":"IF(C32<=TODAY(),IF(I32<J32,J32-I32,0),0)","v":0},null,null,null,null,null,null,null,null,null,null,null,null,null,{"$f":"IF(AF32<>\"\",IF(E32<>\"\",ABS(24*60*(E32-AF32)),ABS(24*60*(G32-AF32))),0)","v":0},{"$f":"COUNTA(AF32,AI32,AK32,AM32)","v":0},null,{"$f":"IF(AI32<>\"\",IF(H32<>\"\",ABS(24*60*(H32-AI32)),ABS(24*60*(F32-AI32))),0)","v":0},null,{"$f":"IF(AK32<>\"\",IF(E32<>\"\",ABS(24*60*(E32-AK32)),ABS(24*60*(G32-AK32))),0)","v":0},null,{"$f":"IF(AM32<>\"\",IF(H32<>\"\",ABS(24*60*(H32-AM32)),ABS(24*60*(F32-AM32))),0)","v":0},null,null,{"$f":"AQ31+R32-S32","v":0}]
[null,null,"2020-01-20","2020-01-20",null,null,null,null,{"$f":"IF(LEN(F33)+LEN(H33)>0,IF(LEN(H33)>0,(HOUR(F33-E33)+MINUTE(F33-E33)/60)+(HOUR(H33-G33)+MINUTE(H33-G33)/60),(HOUR(F33-E33)+MINUTE(F33-E33)/60)),IF(Parameter!$F$29=1,J33,IF(T33=\"\",0,J33)))","v":0},null,null,null,null,null,null,null,null,{"$f":"IF(I33>J33,I33-J33,0)","v":0},{"$f":"IF(C33<=TODAY(),IF(I33<J33,J33-I33,0),0)","v":0},null,null,null,null,null,null,null,null,null,null,null,null,null,{"$f":"IF(AF33<>\"\",IF(E33<>\"\",ABS(24*60*(E33-AF33)),ABS(24*60*(G33-AF33))),0)","v":0},{"$f":"COUNTA(AF33,AI33,AK33,AM33)","v":0},null,{"$f":"IF(AI33<>\"\",IF(H33<>\"\",ABS(24*60*(H33-AI33)),ABS(24*60*(F33-AI33))),0)","v":0},null,{"$f":"IF(AK33<>\"\",IF(E33<>\"\",ABS(24*60*(E33-AK33)),ABS(24*60*(G33-AK33))),0)","v":0},null,{"$f":"IF(AM33<>\"\",IF(H33<>\"\",ABS(24*60*(H33-AM33)),ABS(24*60*(F33-AM33))),0)","v":0},null,null,{"$f":"AQ32+R33-S33","v":0}]
[null,null,"2020-01-21","2020-01-21",null,null,null,null,{"$f":"IF(LEN(F34)+LEN(H34)>0,IF(LEN(H34)>0,(HOUR(F34-E34)+MINUTE(F34-E34)/60)+(HOUR(H34-G34)+MINUTE(H34-G34)/60),(HOUR(F34-E34)+MINUTE(F34-E34)/60)),IF(Parameter!$F$29=1,J34,IF(T34=\"\",0,J34)))","v":0},null,null,null,null,null,null,null,null,{"$f":"IF(I34>J34,I34-J34,0)","v":0},{"$f":"IF(C34<=TODAY(),IF(I34<J34,J34-I34,0),0)","v":0},null,null,null,null,null,null,null,null,null,null,null,null,null,{"$f":"IF(AF34<>\"\",IF(E34<>\"\",ABS(24*60*(E34-AF34)),ABS(24*60*(G34-AF34))),0)","v":0},{"$f":"COUNTA(AF34,AI34,AK34,AM34)","v":0},null,{"$f":"IF(AI34<>\"\",IF(H34<>\"\",ABS(24*60*(H34-AI34)),ABS(24*60*(F34-AI34))),0)","v":0},null,{"$f":"IF(AK34<>\"\",IF(E34<>\"\",ABS(24*60*(E34-AK34)),ABS(24*60*(G34-AK34))),0)","v":0},null,{"$f":"IF(AM34<>\"\",IF(H34<>\"\",ABS(24*60*(H34-AM34)),ABS(24*60*(F34-AM34))),0)","v":0},null,null,{"$f":"AQ33+R34-S34","v":0}]
[null,null,"2020-01-22","2020-01-22",null,null,null,null,{"$f":"IF(LEN(F35)+LEN(H35)>0,IF(LEN(H35)>0,(HOUR(F35-E35)+MINUTE(F35-E35)/60)+(HOUR(H35-G35)+MINUTE(H35-G35)/60),(HOUR(F35-E35)+MINUTE(F35-E35)/60)),IF(Parameter!$F$29=1,J35,IF(T35=\"\",0,J35)))","v":0},null,null,null,null,null,null,null,null,{"$f":"IF(I35>J35,I35-J35,0)","v":0},{"$f":"IF(C35<=TODAY(),IF(I35<J35,J35-I35,0),0)","v":0},null,null,null,null,null,null,null,null,null,null,null,null,null,{"$f":"IF(AF35<>\"\",IF(E35<>\"\",ABS(24*60*(E35-AF35)),ABS(24*60*(G35-AF35))),0)","v":0},{"$f":"COUNTA(AF35,AI35,AK35,AM35)","v":0},null,{"$f":"IF(AI35<>\"\",IF(H35<>\"\",ABS(24*60*(H35-AI35)),ABS(24*60*(F35-AI35))),0)","v":0},null,{"$f":"IF(AK35<>\"\",IF(E35<>\"\",ABS(24*60*(E35-AK35)),ABS(24*60*(G35-AK35))),0)","v":0},null,{"$f":"IF(AM35<>\"\",IF(H35<>\"\",ABS(24*60*(H35-AM35)),ABS(24*60*(F35-AM35))),0)","v":0},null,null,{"$f":"AQ34+R35-S35","v":0}]
[null,null,"2020-01-23","2020-01-23",null,null,null,null,{"$f":"IF(LEN(F36)+LEN(H36)>0,IF(LEN(H36)>0,(HOUR(F36-E36)+MINUTE(F36-E36)/60)+(HOUR(H36-G36)+MINUTE(H36-G36)/60),(HOUR(F36-E36)+MINUTE(F36-E36)/60)),IF(Parameter!$F$29=1,J36,IF(T36=\"\",0,J36)))","v":0},null,null,null,null,null,null,null,null,{"$f":"IF(I36>J36,I36-J36,0)","v":0},{"$f":"IF(C36<=TODAY(),IF(I36<J36,J36-I36,0),0)","v":0},null,null,null,null,null,null,null,null,null,null,null,null,null,{"$f":"IF(AF36<>\"\",IF(E36<>\"\",ABS(24*60*(E36-AF36)),ABS(24*60*(G36-AF36))),0)","v":0},{"$f":"COUNTA(AF36,AI36,AK36,AM36)","v":0},null,{"$f":"IF(AI36<>\"\",IF(H36<>\"\",ABS(24*60*(H36-AI36)),ABS(24*60*(F36-AI36))),0)","v":0},null,{"$f":"IF(AK36<>\"\",IF(E36<>\"\",ABS(24*60*(E36-AK36)),ABS(24*60*(G36-AK36))),0)","v":0},null,{"$f":"IF(AM36<>\"\",IF(H36<>\"\",ABS(24*60*(H36-AM36)),ABS(24*60*(F36-AM36))),0)","v":0},null,null,{"$f":"AQ35+R36-S36","v":0}]
[null,null,"2020-01-24","2020-01-24",null,null,null,null,{"$f":"IF(LEN(F37)+LEN(H37)>0,IF(LEN(H37)>0,(HOUR(F37-E37)+MINUTE(F37-E37)/60)+(HOUR(H37-G37)+MINUTE(H37-G37)/60),(HOUR(F37-E37)+MINUTE(F37-E37)/60)),IF(Parameter!$F$29=1,J37,IF(T37=\"\",0,J37)))","v":0},null,null,null,null,null,null,null,null,{"$f":"IF(I37>J37,I37-J37,0)","v":0},{"$f":"IF(C37<=TODAY(),IF(I37<J37,J37-I37,0),0)","v":0},null,null,null,null,null,null,null,null,null,null,null,null,null,{"$f":"IF(AF37<>\"\",IF(E37<>\"\",ABS(24*60*(E37-AF37)),ABS(24*60*(G37-AF37))),0)","v":0},{"$f":"COUNTA(AF37,AI37,AK37,AM37)","v":0},null,{"$f":"IF(AI37<>\"\",IF(H37<>\"\",ABS(24*60*(H37-AI37)),ABS(24*60*(F37-AI37))),0)","v":0},null,{"$f":"IF(AK37<>\"\",IF(E37<>\"\",ABS(24*60*(E37-AK37)),ABS(24*60*(G37-AK37))),0)","v":0},null,{"$f":"IF(AM37<>\"\",IF(H37<>\"\",ABS(24*60*(H37-AM37)),ABS(24*60*(F37-AM37))),0)","v":0},null,null,{"$f":"AQ36+R37-S37","v":0}]
[null,null,"2020-01-25","2020-01-25",null,null,null,null,{"$f":"IF(LEN(F38)+LEN(H38)>0,IF(LEN(H38)>0,(HOUR(F38-E38)+MINUTE(F38-E38)/60)+(HOUR(H38-G38)+MINUTE(H38-G38)/60),(HOUR(F38-E38)+MINUTE(F38-E38)/60)),IF(Parameter!$F$29=1,J38,IF(T38=\"\",0,J38)))","v":0},null,null,null,null,null,null,null,null,{"$f":"IF(I38>J38,I38-J38,0)","v":0},{"$f":"IF(C38<=TODAY(),IF(I38<J38,J38-I38,0),0)","v":0},null,null,null,null,null,null,null,null,null,null,null,null,null,{"$f":"IF(AF38<>\"\",IF(E38<>\"\",ABS(24*60*(E38-AF38)),ABS(24*60*(G38-AF38))),0)","v":0},{"$f":"COUNTA(AF38,AI38,AK38,AM38)","v":0},null,{"$f":"IF(AI38<>\"\",IF(H38<>\"\",ABS(24*60*(H38-AI38)),ABS(24*60*(F38-AI38))),0)","v":0},null,{"$f":"IF(AK38<>\"\",IF(E38<>\"\",ABS(24*60*(E38-AK38)),ABS(24*60*(G38-AK38))),0)","v":0},null,{"$f":"IF(AM38<>\"\",IF(H38<>\"\",ABS(24*60*(H38-AM38)),ABS(24*60*(F38-AM38))),0)","v":0},null,null,{"$f":"AQ37+R38-S38","v":0}]
[null,null,"2020-01-26","2020-01-26",null,null,null,null,{"$f":"IF(LEN(F39)+LEN(H39)>0,IF(LEN(H39)>0,(HOUR(F39-E39)+MINUTE(F39-E39)/60)+(HOUR(H39-G39)+MINUTE(H39-G39)/60),(HOUR(F39-E39)+MINUTE(F39-E39)/60)),IF(Parameter!$F$29=1,J39,IF(T39=\"\",0,J39)))","v":0},null,null,null,null,null,null,null,null,{"$f":"IF(I39>J39,I39-J39,0)","v":0},{"$f":"IF(C39<=TODAY(),IF(I39<J39,J39-I39,0),0)","v":0},null,null,null,null,null,null,null,null,null,null,null,null,null,{"$f":"IF(AF39<>\"\",IF(E39<>\"\",ABS(24*60*(E39-AF39)),ABS(24*60*(G39-AF39))),0)","v":0},{"$f":"COUNTA(AF39,AI39,AK39,AM39)","v":0},null,{"$f":"IF(AI39<>\"\",IF(H39<>\"\",ABS(24*60*(H39-AI39)),ABS(24*60*(F39-AI39))),0)","v":0},null,{"$f":"IF(AK39<>\"\",IF(E39<>\"\",ABS(24*60*(E39-AK39)),ABS(24*60*(G39-AK39))),0)","v":0},null,{"$f":"IF(AM39<>\"\",IF(H39<>\"\",ABS(24*60*(H39-AM39)),ABS(24*60*(F39-AM39))),0)","v":0},null,null,{"$f":"AQ38+R39-S39","v":0}]
[null,null,"2020-01-27","2020-01-27",null,null,null,null,{"$f":"IF(LEN(F40)+LEN(H40)>0,IF(LEN(H40)>0,(HOUR(F40-E40)+MINUTE(F40-E40)/60)+(HOUR(H40-G40)+MINUTE(H40-G40)/60),(HOUR(F40-E40)+MINUTE(F40-E40)/60)),IF(Parameter!$F$29=1,J40,IF(T40=\"\",0,J40)))","v":0},null,null,null,null,null,null,null,null,{"$f":"IF(I40>J40,I40-J40,0)","v":0},{"$f":"IF(C40<=TODAY(),IF(I40<J40,J40-I40,0),0)","v":0},null,null,null,null,null,null,null,null,null,null,null,null,null,{"$f":"IF(AF40<>\"\",IF(E40<>\"\",ABS(24*60*(E40-AF40)),ABS(24*60*(G40-AF40))),0)","v":0},{"$f":"COUNTA(AF40,AI40,AK40,AM40)","v":0},null,{"$f":"IF(AI40<>\"\",IF(H40<>\"\",ABS(24*60*(H40-AI40)),ABS(24*60*(F40-AI40))),0)","v":0},null,{"$f":"IF(AK40<>\"\",IF(E40<>\"\",ABS(24*60*(E40-AK40)),ABS(24*60*(G40-AK40))),0)","v":0},null,{"$f":"IF(AM40<>\"\",IF(H40<>\"\",ABS(24*60*(H40-AM40)),ABS(24*60*(F40-AM40))),0)","v":0},null,null,{"$f":"AQ39+R40-S40","v":0}]
[null,null,"2020-01-28","2020-01-28",null,null,null,null,{"$f":"IF(LEN(F41)+LEN(H41)>0,IF(LEN(H41)>0,(HOUR(F41-E41)+MINUTE(F41-E41)/60)+(HOUR(H41-G41)+MINUTE(H41-G41)/60),(HOUR(F41-E41)+MINUTE(F41-E41)/60)),IF(Parameter!$F$29=1,J41,IF(T41=\"\",0,J41)))","v":0},null,null,null,null,null,null,null,null,{"$f":"IF(I41>J41,I41-J41,0)","v":0},{"$f":"IF(C41<=TODAY(),IF(I41<J41,J41-I41,0),0)","v":0},null,null,null,null,null,null,null,null,null,null,null,null,null,{"$f":"IF(AF41<>\"\",IF(E41<>\"\",ABS(24*60*(E41-AF41)),ABS(24*60*(G41-AF41))),0)","v":0},{"$f":"COUNTA(AF41,AI41,AK41,AM41)","v":0},null,{"$f":"IF(AI41<>\"\",IF(H41<>\"\",ABS(24*60*(H41-AI41)),ABS(24*60*(F41-AI41))),0)","v":0},null,{"$f":"IF(AK41<>\"\",IF(E41<>\"\",ABS(24*60*(E41-AK41)),ABS(24*60*(G41-AK41))),0)","v":0},null,{"$f":"IF(AM41<>\"\",IF(H41<>\"\",ABS(24*60*(H41-AM41)),ABS(24*60*(F41-AM41))),0)","v":0},null,null,{"$f":"AQ40+R41-S41","v":0}]
[null,null,"2020-01-29","2020-01-29",null,null,null,null,{"$f":"IF(LEN(F42)+LEN(H42)>0,IF(LEN(H42)>0,(HOUR(F42-E42)+MINUTE(F42-E42)/60)+(HOUR(H42-G42)+MINUTE(H42-G42)/60),(HOUR(F42-E42)+MINUTE(F42-E42)/60)),IF(Parameter!$F$29=1,J42,IF(T42=\"\",0,J42)))","v":0},null,null,null,null,null,null,null,null,{"$f":"IF(I42>J42,I42-J42,0)","v":0},{"$f":"IF(C42<=TODAY(),IF(I42<J42,J42-I42,0),0)","v":0},null,null,null,null,null,null,null,null,null,null,null,null,null,{"$f":"IF(AF42<>\"\",IF(E42<>\"\",ABS(24*60*(E42-AF42)),ABS(24*60*(G42-AF42))),0)","v":0},{"$f":"COUNTA(AF42,AI42,AK42,AM42)","v":0},null,{"$f":"IF(AI42<>\"\",IF(H42<>\"\",ABS(24*60*(H42-AI42)),ABS(24*60*(F42-AI42))),0)","v":0},null,{"$f":"IF(AK42<>\"\",IF(E42<>\"\",ABS(24*60*(E42-AK42)),ABS(24*60*(G42-AK42))),0)","v":0},null,{"$f":"IF(AM42<>\"\",IF(H42<>\"\",ABS(24*60*(H42-AM42)),ABS(24*60*(F42-AM42))),0)","v":0},null,null,{"$f":"AQ41+R42-S42","v":0}]
[null,null,{"$f":"IF(MONTH(MonatsErster)<>2,IF(MONTH(C42+1)>MONTH(C42),\"\",C42+1),\"\")","v":"2020-01-30"},"2020-01-30",null,null,null,null,{"$f":"IF(LEN(F43)+LEN(H43)>0,IF(LEN(H43)>0,(HOUR(F43-E43)+MINUTE(F43-E43)/60)+(HOUR(H43-G43)+MINUTE(H43-G43)/60),(HOUR(F43-E43)+MINUTE(F43-E43)/60)),IF(Parameter!$F$29=1,J43,IF(T43=\"\",0,J43)))","v":0},null,null,null,null,null,null,null,null,{"$f":"IF(I43>J43,I43-J43,0)","v":0},{"$f":"IF(C43<=TODAY(),IF(I43<J43,J43-I43,0),0)","v":0},null,null,null,null,null,null,null,null,null,null,null,null,null,{"$f":"IF(AF43<>\"\",IF(E43<>\"\",ABS(24*60*(E43-AF43)),ABS(24*60*(G43-AF43))),0)","v":0},{"$f":"COUNTA(AF43,AI43,AK43,AM43)","v":0},null,{"$f":"IF(AI43<>\"\",IF(H43<>\"\",ABS(24*60*(H43-AI43)),ABS(24*60*(F43-AI43))),0)","v":0},null,{"$f":"IF(AK43<>\"\",IF(E43<>\"\",ABS(24*60*(E43-AK43)),ABS(24*60*(G43-AK43))),0)","v":0},null,{"$f":"IF(AM43<>\"\",IF(H43<>\"\",ABS(24*60*(H43-AM43)),ABS(24*60*(F43-AM43))),0)","v":0},null,null,{"$f":"AQ42+R43-S43","v":0}]
[null,null,{"$f":"IF(MONTH(MonatsErster)<>2,IF(MONTH(C43+1)>MONTH(C43),\"\",C43+1),\"\")","v":"2020-01-31"},"2020-01-31",null,null,null,null,{"$f":"IF(LEN(F44)+LEN(H44)>0,IF(LEN(H44)>0,(HOUR(F44-E44)+MINUTE(F44-E44)/60)+(HOUR(H44-G44)+MINUTE(H44-G44)/60),(HOUR(F44-E44)+MINUTE(F44-E44)/60)),IF(Parameter!$F$29=1,J44,IF(T44=\"\",0,J44)))","v":0},null,null,null,null,null,null,null,null,{"$f":"IF(I44>J44,I44-J44,0)","v":0},{"$f":"IF(C44<=TODAY(),IF(I44<J44,J44-I44,0),0)","v":0},null,null,null,null,null,null,null,null,null,null,null,null,null,{"$f":"IF(AF44<>\"\",IF(E44<>\"\",ABS(24*60*(E44-AF44)),ABS(24*60*(G44-AF44))),0)","v":0},{"$f":"COUNTA(AF44,AI44,AK44,AM44)","v":0},null,{"$f":"IF(AI44<>\"\",IF(H44<>\"\",ABS(24*60*(H44-AI44)),ABS(24*60*(F44-AI44))),0)","v":0},null,{"$f":"IF(AK44<>\"\",IF(E44<>\"\",ABS(24*60*(E44-AK44)),ABS(24*60*(G44-AK44))),0)","v":0},null,{"$f":"IF(AM44<>\"\",IF(H44<>\"\",ABS(24*60*(H44-AM44)),ABS(24*60*(F44-AM44))),0)","v":0},null,null,{"$f":"AQ43+R44-S44","v":0}]
[null,null,null,null,null,null,null,"Summe:",{"$f":"ROUND(SUM(I14:I44),2)","v":0},{"$f":"ROUND(SUM(J13:J44),2)","v":0},{"$f":"SUM(K14:K44)","v":0},0,0,0,0,0,0,{"$f":"ROUND(SUM(R14:R44),2)","v":0},{"$f":"ROUND(SUM(S14:S44),2)","v":0},{"$f":"IF(COUNTA(T14:T44)=0,\"\",\"/U:\" & COUNTIF(T14:T44,\"u\")&\"/K:\" & COUNTIF(T14:T44,\"k\")&\"/Rest:\" & COUNTA(T14:T44)-COUNTIF(T14:T44,\"u\")-COUNTIF(T14:T44,\"k\"))","v":""},null,null,"Kontrollsummen:",null,null,null,null,null,null,null,null,null,null,null,null,null,null,null,null,null,null,null,null,{"$f":"SUM(AR14:AR44)","v":0},0,0,0,null,0,0,null,"Durchschnitt"]
[null,null,null,null,null,null,null,null,null,null,null,null,null,null,null,null,null,{"$f":"ROUND(R45-S45,2)","v":0},null,"Monatssaldo",null,null,{"$f":"\"IST-Stunden \"&ISTsumme&\" - SOLL-Stunden \"&SOLLsumme&\" =\"","v":"IST-Stunden 0 - SOLL-Stunden 0 ="},null,null,{"$f":"ISTsumme-SOLLsumme","v":0},null,null,null,null,null,null,null,null,null,null,null,null,null,null,null,null,null,null,null,null,null,null,null,null,null,{"$f":"IFERROR(SUM(AZ14:AZ44)/COUNTA(AZ14:AZ44),\"\")","v":""}]
[null,null,"Über-/Mehrstunden",null,null,{"$f":"ROUND(AT45+AU45,2)","v":0},"korr.Endsaldo inkl.Vorperiode:",null,null,null,null,null,null,null,null,null,null,{"$f":"ROUND(R9+R46,2)+F48","v":0},null,"Endsaldo inkl.Vorperiode",null,null,{"$f":"IF(M45<>0,\"minus automatische Überstunden:\",\"Monatssaldo (Zelle R46):\")","v":"Monatssaldo (Zelle R46):"},null,null,{"$f":"IF(M45<>0,-M45,R46)","v":0}]
[null,null,"Zeitsaldo Korrektur",null,null,{"$f":"ROUND((AS45-AT45),2)","v":0},null,null,null,null,null,null,null,null,null,null,null,null,null,"Auszahlung Gutstunden",null,null,{"$f":"IF(M45<>0,\"=Monatssaldo (Zelle R46):\",\"Differenz =\")","v":"Differenz ="},null,null,{"$f":"IF(M45<>0,(Z46+Z47),ROUND(Z46-Z47,1))","v":0}]
[null,null,"Info Lohn: ",null,null,null,null,null,null,null,null,null,null,null,null,null,null,{"$f":"R47-R48","v":0},null,"Vortrag abzgl.Auszahlg.",null,null,{"$f":"IF(M45<>0,\"Differenz =\",\"\")","v":""},null,null,{"$f":"IF(M45<>0,ROUND(Z48-R46,1),\"\")","v":""}]

{"sheet":"2 FEB","index":4,"n_rows":49,"n_cols":75,"rows_kept":49,"cut":false,"hidden":false,"merged":[[2,34,2,35],[5,27,6,27],[8,26,9,26],[2,30,2,32],[47,22,47,24],[45,22,45,24],[46,22,46,24],[11,23,11,24],[11,25,11,26],[10,22,10,26],[11,34,11,35],[48,19,48,21],[10,10,12,10],[10,11,12,11],[10,12,12,12],[45,19,45,21],[47,10,47,13],[46,6,46,16],[45,8,45,9],[10,20,12,20],[44,19,44,20],[7,12,8,12],[0,22,0,26],[48,22,48,24],[10,14,12,14],[10,15,12,15],[10,16,12,16],[48,17,48,18],[11,17,11,18],[46,17,46,18],[10,19,12,19],[47,14,47,16],[47,17,47,18],[11,22,12,22],[45,17,45,18],[46,19,46,21],[47,19,47,21],[7,2,7,3],[7,4,7,8],[8,4,8,8],[7,10,8,10],[7,11,8,11],[10,3,11,3],[11,6,11,7],[10,8,11,9],[8,2,8,3],[11,4,11,5],[10,4,10,7],[10,2,11,2],[48,2,48,3],[48,4,48,9],[46,2,46,4],[47,2,47,4],[47,6,47,9],[2,69,11,69],[2,70,11,70],[5,16,6,16],[2,2,2,18],[6,26,7,26],[5,22,5,24],[5,5,5,8],[5,2,5,4],[5,10,5,13],[7,16,8,16],[8,17,8,18],[7,14,8,14],[7,15,8,15],[5,17,7,18],[7,13,8,13],[10,13,12,13],[2,71,11,71],[2,72,11,72],[2,73,11,73],[2,74,11,74],[2,37,2,38],[10,51,12,51],[10,47,12,47],[10,48,12,48],[10,49,12,49],[10,50,12,50],[10,46,12,46],[10,42,12,42],[10,43,12,43],[10,44,12,44],[10,45,12,45],[11,37,11,38]]}
[]
[]
[null,null,null,null,null,null,null,null,null,null,null,null,null,null,null,null,null,null,null,null,null,null,null,null,null,null,null,null,null,null,null,null,null,null,null,null,null,null,null,null,null,null,null,null,null,null,null,null,null,null,null,null,null,null,null,null,null,null,null,null,null,null,null,null,null,null,null,null,null,{"$f":"IF(AND(Parameter!B69<>\"\"),Parameter!B69&\" \"&Parameter!E69&\"%\",\"\")","v":"Zuschlag vor DP-Beginn 25%"},{"$f":"IF(AND(Parameter!E70<>\"\",Parameter!F70<>\"\"),Parameter!B70&\" \"&TEXT(Parameter!F70,\"hh:mm\")&\" \"&Parameter!E70&\"%\",\"\")","v":"Zuschlag innerhalb DP \nnach 1.Uhrzeit 19:30 50%"},{"$f":"Parameter!B71&\" \"&TEXT(Parameter!F71,\"hh:mm\")&\" \"&Parameter!E71&\"%\"","v":"Zuschlag innerhalb DP \nnach 2.Uhrzeit 21:00 75%"},{"$f":"Parameter!B72&\" \"&TEXT(Parameter!F72,\"hh:mm\")&\" \"&Parameter!E72&\"%\"","v":"Zuschlag außerhalb DP \nnach 1.Uhrzeit 19:30 100%"},{"$f":"Parameter!B73&\" \"&TEXT(Parameter!F73,\"hh:mm\")&\" \"&Parameter!E73&\"%\"","v":"Zuschlag außerhalb DP \nnach 2.Uhrzeit 21:00 125%"},{"$f":"IF(AND(Parameter!B74<>\"\"),Parameter!B74&\" \"&Parameter!E74&\"%\",\"\")","v":"Zuschlag nach DP-Ende 150%"}]
[]
[]
[null,null,"Monat",null,null,{"$f":"MonatsErster+31","v":"2020-02-01"},null,null,null,null,"täglich",null,null,null,"So/Feier","Woche",{"$f":"IF(LEFT(Parameter!J62,1)=\"1\",\"Manuell\",\"Morgen Zeit\")","v":"Manuell"},"Vortrag\nVormonat"]
[]
[null,null,"MitarbeitNr.",null,{"$f":"IF('1 JAN'!E8<>\"\",'1 JAN'!E8,\"\")","v":""},null,null,null,null,null,{"$f":"Parameter!Q50","v":">21:00   100% Üh   "},{"$f":"Parameter!Q52","v":">19:30   50% Üh   "},{"$f":"Parameter!Q54","v":">9h                 50% Üh   "},{"$f":"Parameter!Q56","v":"> Soll-h bis 9 Std.                    50% Üh   "},{"$f":"Parameter!Q58","v":"So/Feiert 100% Üh   "},{"$f":"Parameter!Q60","v":">39h      100% Üh   "},{"$f":"Parameter!Q62","v":"manuell    50% Mh   "}]
[null,null,"Name:",null,{"$f":"IF('1 JAN'!E9<>\"\",'1 JAN'!E9,\"\")","v":""},null,null,null,null,null,null,null,null,null,null,null,null,{"$f":"IF(Parameter!F34=TRUE,'1 JAN'!R49:S49,0)","v":0}]
[null,null,null,{"$f":"IF(D16=\"Fr\",\"JA\",\"\")","v":""}]
[null,null,"Datum","Tag","tatsächliche Arbeitszeit",null,null,null," Gesamt\nStunden",null,{"$f":"MID(Parameter!F50,3,99)","v":"Grund-Stunde ZA - Zuschlag auszahlen"},{"$f":"MID(Parameter!F52,3,99)","v":"Grund-Stunde ZA - Zuschlag auszahlen"},{"$f":"MID(Parameter!F54,3,99)","v":"Grund-Stunde ZA - Zuschlag auszahlen"},{"$f":"MID(Parameter!F56,3,99)","v":"Grund-Stunde ZA - Zuschlag auszahlen"},{"$f":"MID(Parameter!F58,3,99)","v":"Grund-Stunde ZA - Zuschlag auszahlen"},{"$f":"MID(Parameter!F60,3,99)","v":"Grund-Stunde ZA - Zuschlag auszahlen"},{"$f":"MID(Parameter!F62,3,99)","v":"Grund-Stunde ZA - Zuschlag auszahlen"},"Gut-","Minus-"," Urlaub\nKrank\n\nU oder K \nmachen","Feiertag\n\nF-ix\nB-ewegl.",null,{"$f":"IF(AND(UPPER(Parameter!G68=\"AKTIV\"),UPPER(Parameter!R69=\"AKTIV\")),\"Dienstplan-Vorschlag übernehmen\",IF(UPPER(Parameter!G68=\"AKTIV\"),\"Dienstplan\",\"Manuelle Zeiterfassung\"))","v":"Manuelle Zeiterfassung"},null,null,null,null,null,null,null,null,null,null,null,null,null,null,null,null,null,null,null,"Aktueller\nTages\nSaldo","Summe Grundstunden\nim Zeitsaldo","Summe \nZuschlag \nZeitsaldo \nerhöhend","Summe Grundstunden\nzur Auszahlung","Summe \nZuschlag\nzur Auszahlung","Korrigierter Tagessaldo","Korrigierte \nTages IST-Std","Differenz SOLL-Std zu IST-Std inkl. Zeitsaldo Korrekturen","Tagesstunden + sonntags Summe Wochen-\nStunden","Wochen\nsumme \n(korrigiert)"]
[null,null,null,null,"Vormittag",null,"Nachmittag",null,null,null,null,null,null,null,null,null,null,"Stunden",null,null,null,null,{"$f":"IF(UPPER(Parameter!G68)=\"AKTIV\",\"Manuelle Zeiten in Spalte W sind monatlich manuell in die Spalten E-H zu übernehmen\",\"Begründung manuelle Zeiterfassung\")","v":"Begründung manuelle Zeiterfassung"},"Vormittag",null,"Nachmittag"]
[null,"OK",null,null,"von","bis","von","bis","Ist","Soll",null,null,null,null,null,null,null,"+","-",null,null,null,null,"von","bis","von","bis",null,null,null,"Anmerkung","Internet AN Vorm.","Differenz","Anzahl Internetzeiten","Internet AB Vorm","Differenz","Internet AN Nachm.","Differenz","Internet AB Nachm.","Differenz",null,null,null,null,null,null,null,null,null,null,null,null,null,null,null,null,null,null,null,null,null,null,null,null,null,null,null,null,null,{"$f":"SUM(BR14:BR44)","v":0},0,0,0,0,0]
[null,null,{"$f":"DATE('1 JAN'!G2,2,1)","v":"2020-02-01"},{"$f":"C14","v":"2020-02-01"},null,null,null,null,{"$f":"IF(LEN(F14)+LEN(H14)>0,IF(LEN(H14)>0,(HOUR(F14-E14)+MINUTE(F14-E14)/60)+(HOUR(H14-G14)+MINUTE(H14-G14)/60),(HOUR(F14-E14)+MINUTE(F14-E14)/60)),IF(Parameter!$F$29=1,J14,IF(T14=\"\",0,J14)))","v":0},null,null,null,null,null,null,null,null,{"$f":"IF(I14>J14,I14-J14,0)","v":0},{"$f":"IF(C14<=TODAY(),IF(I14<J14,J14-I14,0),0)","v":0},null,null,null,null,null,null,null,null,null,null,null,null,null,{"$f":"IF(AF14<>\"\",IF(E14<>\"\",ABS(24*60*(E14-AF14)),ABS(24*60*(G14-AF14))),0)","v":0},{"$f":"COUNTA(AF14,AI14,AK14,AM14)","v":0},null,{"$f":"IF(AI14<>\"\",IF(H14<>\"\",ABS(24*60*(H14-AI14)),ABS(24*60*(F14-AI14))),0)","v":0},null,{"$f":"IF(AK14<>\"\",IF(E14<>\"\",ABS(24*60*(E14-AK14)),ABS(24*60*(G14-AK14))),0)","v":0},null,{"$f":"IF(AM14<>\"\",IF(H14<>\"\",ABS(24*60*(H14-AM14)),ABS(24*60*(F14-AM14))),0)","v":0},null,null,{"$f":"R9+R14-S14","v":0}]
[null,null,{"$f":"IF(MONTH(C14+1)>MONTH(C14),\"\",C14+1)","v":"2020-02-02"},"2020-02-02",null,null,null,null,{"$f":"IF(LEN(F15)+LEN(H15)>0,IF(LEN(H15)>0,(HOUR(F15-E15)+MINUTE(F15-E15)/60)+(HOUR(H15-G15)+MINUTE(H15-G15)/60),(HOUR(F15-E15)+MINUTE(F15-E15)/60)),IF(Parameter!$F$29=1,J15,IF(T15=\"\",0,J15)))","v":0},null,null,null,null,null,null,null,null,{"$f":"IF(I15>J15,I15-J15,0)","v":0},{"$f":"IF(C15<=TODAY(),IF(I15<J15,J15-I15,0),0)","v":0},null,null,null,null,null,null,null,null,null,null,null,null,null,{"$f":"IF(AF15<>\"\",IF(E15<>\"\",ABS(24*60*(E15-AF15)),ABS(24*60*(G15-AF15))),0)","v":0},{"$f":"COUNTA(AF15,AI15,AK15,AM15)","v":0},null,{"$f":"IF(AI15<>\"\",IF(H15<>\"\",ABS(24*60*(H15-AI15)),ABS(24*60*(F15-AI15))),0)","v":0},null,{"$f":"IF(AK15<>\"\",IF(E15<>\"\",ABS(24*60*(E15-AK15)),ABS(24*60*(G15-AK15))),0)","v":0},null,{"$f":"IF(AM15<>\"\",IF(H15<>\"\",ABS(24*60*(H15-AM15)),ABS(24*60*(F15-AM15))),0)","v":0},null,null,{"$f":"AQ14+R15-S15","v":0}]
[null,null,"2020-02-03","2020-02-03",null,null,null,null,{"$f":"IF(LEN(F16)+LEN(H16)>0,IF(LEN(H16)>0,(HOUR(F16-E16)+MINUTE(F16-E16)/60)+(HOUR(H16-G16)+MINUTE(H16-G16)/60),(HOUR(F16-E16)+MINUTE(F16-E16)/60)),IF(Parameter!$F$29=1,J16,IF(T16=\"\",0,J16)))","v":0},null,null,null,null,null,null,null,null,{"$f":"IF(I16>J16,I16-J16,0)","v":0},{"$f":"IF(C16<=TODAY(),IF(I16<J16,J16-I16,0),0)","v":0},null,null,null,null,null,null,null,null,null,null,null,null,null,{"$f":"IF(AF16<>\"\",IF(E16<>\"\",ABS(24*60*(E16-AF16)),ABS(24*60*(G16-AF16))),0)","v":0},{"$f":"COUNTA(AF16,AI16,AK16,AM16)","v":0},null,{"$f":"IF(AI16<>\"\",IF(H16<>\"\",ABS(24*60*(H16-AI16)),ABS(24*60*(F16-AI16))),0)","v":0},null,{"$f":"IF(AK16<>\"\",IF(E16<>\"\",ABS(24*60*(E16-AK16)),ABS(24*60*(G16-AK16))),0)","v":0},null,{"$f":"IF(AM16<>\"\",IF(H16<>\"\",ABS(24*60*(H16-AM16)),ABS(24*60*(F16-AM16))),0)","v":0},null,null,{"$f":"AQ15+R16-S16","v":0}]
[null,null,"2020-02-04","2020-02-04",null,null,null,null,{"$f":"IF(LEN(F17)+LEN(H17)>0,IF(LEN(H17)>0,(HOUR(F17-E17)+MINUTE(F17-E17)/60)+(HOUR(H17-G17)+MINUTE(H17-G17)/60),(HOUR(F17-E17)+MINUTE(F17-E17)/60)),IF(Parameter!$F$29=1,J17,IF(T17=\"\",0,J17)))","v":0},null,null,null,null,null,null,null,null,{"$f":"IF(I17>J17,I17-J17,0)","v":0},{"$f":"IF(C17<=TODAY(),IF(I17<J17,J17-I17,0),0)","v":0},null,null,null,null,null,null,null,null,null,null,null,null,null,{"$f":"IF(AF17<>\"\",IF(E17<>\"\",ABS(24*60*(E17-AF17)),ABS(24*60*(G17-AF17))),0)","v":0},{"$f":"COUNTA(AF17,AI17,AK17,AM17)","v":0},null,{"$f":"IF(AI17<>\"\",IF(H17<>\"\",ABS(24*60*(H17-AI17)),ABS(24*60*(F17-AI17))),0)","v":0},null,{"$f":"IF(AK17<>\"\",IF(E17<>\"\",ABS(24*60*(E17-AK17)),ABS(24*60*(G17-AK17))),0)","v":0},null,{"$f":"IF(AM17<>\"\",IF(H17<>\"\",ABS(24*60*(H17-AM17)),ABS(24*60*(F17-AM17))),0)","v":0},null,null,{"$f":"AQ16+R17-S17","v":0}]
[null,null,"2020-02-05","2020-02-05",null,null,null,null,{"$f":"IF(LEN(F18)+LEN(H18)>0,IF(LEN(H18)>0,(HOUR(F18-E18)+MINUTE(F18-E18)/60)+(HOUR(H18-G18)+MINUTE(H18-G18)/60),(HOUR(F18-E18)+MINUTE(F18-E18)/60)),IF(Parameter!$F$29=1,J18,IF(T18=\"\",0,J18)))","v":0},null,null,null,null,null,null,null,null,{"$f":"IF(I18>J18,I18-J18,0)","v":0},{"$f":"IF(C18<=TODAY(),IF(I18<J18,J18-I18,0),0)","v":0},null,null,null,null,null,null,null,null,null,null,null,null,null,{"$f":"IF(AF18<>\"\",IF(E18<>\"\",ABS(24*60*(E18-AF18)),ABS(24*60*(G18-AF18))),0)","v":0},{"$f":"COUNTA(AF18,AI18,AK18,AM18)","v":0},null,{"$f":"IF(AI18<>\"\",IF(H18<>\"\",ABS(24*60*(H18-AI18)),ABS(24*60*(F18-AI18))),0)","v":0},null,{"$f":"IF(AK18<>\"\",IF(E18<>\"\",ABS(24*60*(E18-AK18)),ABS(24*60*(G18-AK18))),0)","v":0},null,{"$f":"IF(AM18<>\"\",IF(H18<>\"\",ABS(24*60*(H18-AM18)),ABS(24*60*(F18-AM18))),0)","v":0},null,null,{"$f":"AQ17+R18-S18","v":0}]
[null,null,"2020-02-06","2020-02-06",null,null,null,null,{"$f":"IF(LEN(F19)+LEN(H19)>0,IF(LEN(H19)>0,(HOUR(F19-E19)+MINUTE(F19-E19)/60)+(HOUR(H19-G19)+MINUTE(H19-G19)/60),(HOUR(F19-E19)+MINUTE(F19-E19)/60)),IF(Parameter!$F$29=1,J19,IF(T19=\"\",0,J19)))","v":0},null,null,null,null,null,null,null,null,{"$f":"IF(I19>J19,I19-J19,0)","v":0},{"$f":"IF(C19<=TODAY(),IF(I19<J19,J19-I19,0),0)","v":0},null,null,null,null,null,null,null,null,null,null,null,null,null,{"$f":"IF(AF19<>\"\",IF(E19<>\"\",ABS(24*60*(E19-AF19)),ABS(24*60*(G19-AF19))),0)","v":0},{"$f":"COUNTA(AF19,AI19,AK19,AM19)","v":0},null,{"$f":"IF(AI19<>\"\",IF(H19<>\"\",ABS(24*60*(H19-AI19)),ABS(24*60*(F19-AI19))),0)","v":0},null,{"$f":"IF(AK19<>\"\",IF(E19<>\"\",ABS(24*60*(E19-AK19)),ABS(24*60*(G19-AK19))),0)","v":0},null,{"$f":"IF(AM19<>\"\",IF(H19<>\"\",ABS(24*60*(H19-AM19)),ABS(24*60*(F19-AM19))),0)","v":0},null,null,{"$f":"AQ18+R19-S19","v":0}]
[null,null,"2020-02-07","2020-02-07",null,null,null,null,{"$f":"IF(LEN(F20)+LEN(H20)>0,IF(LEN(H20)>0,(HOUR(F20-E20)+MINUTE(F20-E20)/60)+(HOUR(H20-G20)+MINUTE(H20-G20)/60),(HOUR(F20-E20)+MINUTE(F20-E20)/60)),IF(Parameter!$F$29=1,J20,IF(T20=\"\",0,J20)))","v":0},null,null,null,null,null,null,null,null,{"$f":"IF(I20>J20,I20-J20,0)","v":0},{"$f":"IF(C20<=TODAY(),IF(I20<J20,J20-I20,0),0)","v":0},null,null,null,null,null,null,null,null,null,null,null,null,null,{"$f":"IF(AF20<>\"\",IF(E20<>\"\",ABS(24*60*(E20-AF20)),ABS(24*60*(G20-AF20))),0)","v":0},{"$f":"COUNTA(AF20,AI20,AK20,AM20)","v":0},null,{"$f":"IF(AI20<>\"\",IF(H20<>\"\",ABS(24*60*(H20-AI20)),ABS(24*60*(F20-AI20))),0)","v":0},null,{"$f":"IF(AK20<>\"\",IF(E20<>\"\",ABS(24*60*(E20-AK20)),ABS(24*60*(G20-AK20))),0)","v":0},null,{"$f":"IF(AM20<>\"\",IF(H20<>\"\",ABS(24*60*(H20-AM20)),ABS(24*60*(F20-AM20))),0)","v":0},null,null,{"$f":"AQ19+R20-S20","v":0}]
[null,null,"2020-02-08","2020-02-08",null,null,null,null,{"$f":"IF(LEN(F21)+LEN(H21)>0,IF(LEN(H21)>0,(HOUR(F21-E21)+MINUTE(F21-E21)/60)+(HOUR(H21-G21)+MINUTE(H21-G21)/60),(HOUR(F21-E21)+MINUTE(F21-E21)/60)),IF(Parameter!$F$29=1,J21,IF(T21=\"\",0,J21)))","v":0},null,null,null,null,null,null,null,null,{"$f":"IF(I21>J21,I21-J21,0)","v":0},{"$f":"IF(C21<=TODAY(),IF(I21<J21,J21-I21,0),0)","v":0},null,null,null,null,null,null,null,null,null,null,null,null,null,{"$f":"IF(AF21<>\"\",IF(E21<>\"\",ABS(24*60*(E21-AF21)),ABS(24*60*(G21-AF21))),0)","v":0},{"$f":"COUNTA(AF21,AI21,AK21,AM21)","v":0},null,{"$f":"IF(AI21<>\"\",IF(H21<>\"\",ABS(24*60*(H21-AI21)),ABS(24*60*(F21-AI21))),0)","v":0},null,{"$f":"IF(AK21<>\"\",IF(E21<>\"\",ABS(24*60*(E21-AK21)),ABS(24*60*(G21-AK21))),0)","v":0},null,{"$f":"IF(AM21<>\"\",IF(H21<>\"\",ABS(24*60*(H21-AM21)),ABS(24*60*(F21-AM21))),0)","v":0},null,null,{"$f":"AQ20+R21-S21","v":0}]
[null,null,"2020-02-09","2020-02-09",null,null,null,null,{"$f":"IF(LEN(F22)+LEN(H22)>0,IF(LEN(H22)>0,(HOUR(F22-E22)+MINUTE(F22-E22)/60)+(HOUR(H22-G22)+MINUTE(H22-G22)/60),(HOUR(F22-E22)+MINUTE(F22-E22)/60)),IF(Parameter!$F$29=1,J22,IF(T22=\"\",0,J22)))","v":0},null,null,null,null,null,null,null,null,{"$f":"IF(I22>J22,I22-J22,0)","v":0},{"$f":"IF(C22<=TODAY(),IF(I22<J22,J22-I22,0),0)","v":0},null,null,null,null,null,null,null,null,null,null,null,null,null,{"$f":"IF(AF22<>\"\",IF(E22<>\"\",ABS(24*60*(E22-AF22)),ABS(24*60*(G22-AF22))),0)","v":0},{"$f":"COUNTA(AF22,AI22,AK22,AM22)","v":0},null,{"$f":"IF(AI22<>\"\",IF(H22<>\"\",ABS(24*60*(H22-AI22)),ABS(24*60*(F22-AI22))),0)","v":0},null,{"$f":"IF(AK22<>\"\",IF(E22<>\"\",ABS(24*60*(E22-AK22)),ABS(24*60*(G22-AK22))),0)","v":0},null,{"$f":"IF(AM22<>\"\",IF(H22<>\"\",ABS(24*60*(H22-AM22)),ABS(24*60*(F22-AM22))),0)","v":0},null,null,{"$f":"AQ21+R22-S22","v":0}]
[null,null,"2020-02-10","2020-02-10",null,null,null,null,{"$f":"IF(LEN(F23)+LEN(H23)>0,IF(LEN(H23)>0,(HOUR(F23-E23)+MINUTE(F23-E23)/60)+(HOUR(H23-G23)+MINUTE(H23-G23)/60),(HOUR(F23-E23)+MINUTE(F23-E23)/60)),IF(Parameter!$F$29=1,J23,IF(T23=\"\",0,J23)))","v":0},null,null,null,null,null,null,null,null,{"$f":"IF(I23>J23,I23-J23,0)","v":0},{"$f":"IF(C23<=TODAY(),IF(I23<J23,J23-I23,0),0)","v":0},null,null,null,null,null,null,null,null,null,null,null,null,null,{"$f":"IF(AF23<>\"\",IF(E23<>\"\",ABS(24*60*(E23-AF23)),ABS(24*60*(G23-AF23))),0)","v":0},{"$f":"COUNTA(AF23,AI23,AK23,AM23)","v":0},null,{"$f":"IF(AI23<>\"\",IF(H23<>\"\",ABS(24*60*(H23-AI23)),ABS(24*60*(F23-AI23))),0)","v":0},null,{"$f":"IF(AK23<>\"\",IF(E23<>\"\",ABS(24*60*(E23-AK23)),ABS(24*60*(G23-AK23))),0)","v":0},null,{"$f":"IF(AM23<>\"\",IF(H23<>\"\",ABS(24*60*(H23-AM23)),ABS(24*60*(F23-AM23))),0)","v":0},null,null,{"$f":"AQ22+R23-S23","v":0}]
[null,null,"2020-02-11","2020-02-11",null,null,null,null,{"$f":"IF(LEN(F24)+LEN(H24)>0,IF(LEN(H24)>0,(HOUR(F24-E24)+MINUTE(F24-E24)/60)+(HOUR(H24-G24)+MINUTE(H24-G24)/60),(HOUR(F24-E24)+MINUTE(F24-E24)/60)),IF(Parameter!$F$29=1,J24,IF(T24=\"\",0,J24)))","v":0},null,null,null,null,null,null,null,null,{"$f":"IF(I24>J24,I24-J24,0)","v":0},{"$f":"IF(C24<=TODAY(),IF(I24<J24,J24-I24,0),0)","v":0},null,null,null,null,null,null,null,null,null,null,null,null,null,{"$f":"IF(AF24<>\"\",IF(E24<>\"\",ABS(24*60*(E24-AF24)),ABS(24*60*(G24-AF24))),0)","v":0},{"$f":"COUNTA(AF24,AI24,AK24,AM24)","v":0},null,{"$f":"IF(AI24<>\"\",IF(H24<>\"\",ABS(24*60*(H24-AI24)),ABS(24*60*(F24-AI24))),0)","v":0},null,{"$f":"IF(AK24<>\"\",IF(E24<>\"\",ABS(24*60*(E24-AK24)),ABS(24*60*(G24-AK24))),0)","v":0},null,{"$f":"IF(AM24<>\"\",IF(H24<>\"\",ABS(24*60*(H24-AM24)),ABS(24*60*(F24-AM24))),0)","v":0},null,null,{"$f":"AQ23+R24-S24","v":0}]
[null,null,"2020-02-12","2020-02-12",null,null,null,null,{"$f":"IF(LEN(F25)+LEN(H25)>0,IF(LEN(H25)>0,(HOUR(F25-E25)+MINUTE(F25-E25)/60)+(HOUR(H25-G25)+MINUTE(H25-G25)/60),(HOUR(F25-E25)+MINUTE(F25-E25)/60)),IF(Parameter!$F$29=1,J25,IF(T25=\"\",0,J25)))","v":0},null,null,null,null,null,null,null,null,{"$f":"IF(I25>J25,I25-J25,0)","v":0},{"$f":"IF(C25<=TODAY(),IF(I25<J25,J25-I25,0),0)","v":0},null,null,null,null,null,null,null,null,null,null,null,null,null,{"$f":"IF(AF25<>\"\",IF(E25<>\"\",ABS(24*60*(E25-AF25)),ABS(24*60*(G25-AF25))),0)","v":0},{"$f":"COUNTA(AF25,AI25,AK25,AM25)","v":0},null,{"$f":"IF(AI25<>\"\",IF(H25<>\"\",ABS(24*60*(H25-AI25)),ABS(24*60*(F25-AI25))),0)","v":0},null,{"$f":"IF(AK25<>\"\",IF(E25<>\"\",ABS(24*60*(E25-AK25)),ABS(24*60*(G25-AK25))),0)","v":0},null,{"$f":"IF(AM25<>\"\",IF(H25<>\"\",ABS(24*60*(H25-AM25)),ABS(24*60*(F25-AM25))),0)","v":0},null,null,{"$f":"AQ24+R25-S25","v":0}]
[null,null,"2020-02-13","2020-02-13",null,null,null,null,{"$f":"IF(LEN(F26)+LEN(H26)>0,IF(LEN(H26)>0,(HOUR(F26-E26)+MINUTE(F26-E26)/60)+(HOUR(H26-G26)+MINUTE(H26-G26)/60),(HOUR(F26-E26)+MINUTE(F26-E26)/60)),IF(Parameter!$F$29=1,J26,IF(T26=\"\",0,J26)))","v":0},null,null,null,null,null,null,null,null,{"$f":"IF(I26>J26,I26-J26,0)","v":0},{"$f":"IF(C26<=TODAY(),IF(I26<J26,J26-I26,0),0)","v":0},null,null,null,null,null,null,null,null,null,null,null,null,null,{"$f":"IF(AF26<>\"\",IF(E26<>\"\",ABS(24*60*(E26-AF26)),ABS(24*60*(G26-AF26))),0)","v":0},{"$f":"COUNTA(AF26,AI26,AK26,AM26)","v":0},null,{"$f":"IF(AI26<>\"\",IF(H26<>\"\",ABS(24*60*(H26-AI26)),ABS(24*60*(F26-AI26))),0)","v":0},null,{"$f":"IF(AK26<>\"\",IF(E26<>\"\",ABS(24*60*(E26-AK26)),ABS(24*60*(G26-AK26))),0)","v":0},null,{"$f":"IF(AM26<>\"\",IF(H26<>\"\",ABS(24*60*(H26-AM26)),ABS(24*60*(F26-AM26))),0)","v":0},null,null,{"$f":"AQ25+R26-S26","v":0}]
[null,null,"2020-02-14","2020-02-14",null,null,null,null,{"$f":"IF(LEN(F27)+LEN(H27)>0,IF(LEN(H27)>0,(HOUR(F27-E27)+MINUTE(F27-E27)/60)+(HOUR(H27-G27)+MINUTE(H27-G27)/60),(HOUR(F27-E27)+MINUTE(F27-E27)/60)),IF(Parameter!$F$29=1,J27,IF(T27=\"\",0,J27)))","v":0},null,null,null,null,null,null,null,null,{"$f":"IF(I27>J27,I27-J27,0)","v":0},{"$f":"IF(C27<=TODAY(),IF(I27<J27,J27-I27,0),0)","v":0},null,null,null,null,null,null,null,null,null,null,null,null,null,{"$f":"IF(AF27<>\"\",IF(E27<>\"\",ABS(24*60*(E27-AF27)),ABS(24*60*(G27-AF27))),0)","v":0},{"$f":"COUNTA(AF27,AI27,AK27,AM27)","v":0},null,{"$f":"IF(AI27<>\"\",IF(H27<>\"\",ABS(24*60*(H27-AI27)),ABS(24*60*(F27-AI27))),0)","v":0},null,{"$f":"IF(AK27<>\"\",IF(E27<>\"\",ABS(24*60*(E27-AK27)),ABS(24*60*(G27-AK27))),0)","v":0},null,{"$f":"IF(AM27<>\"\",IF(H27<>\"\",ABS(24*60*(H27-AM27)),ABS(24*60*(F27-AM27))),0)","v":0},null,null,{"$f":"AQ26+R27-S27","v":0}]
[null,null,"2020-02-15","2020-02-15",null,null,null,null,{"$f":"IF(LEN(F28)+LEN(H28)>0,IF(LEN(H28)>0,(HOUR(F28-E28)+MINUTE(F28-E28)/60)+(HOUR(H28-G28)+MINUTE(H28-G28)/60),(HOUR(F28-E28)+MINUTE(F28-E28)/60)),IF(Parameter!$F$29=1,J28,IF(T28=\"\",0,J28)))","v":0},null,null,null,null,null,null,null,null,{"$f":"IF(I28>J28,I28-J28,0)","v":0},{"$f":"IF(C28<=TODAY(),IF(I28<J28,J28-I28,0),0)","v":0},null,null,null,null,null,null,null,null,null,null,null,null,null,{"$f":"IF(AF28<>\"\",IF(E28<>\"\",ABS(24*60*(E28-AF28)),ABS(24*60*(G28-AF28))),0)","v":0},{"$f":"COUNTA(AF28,AI28,AK28,AM28)","v":0},null,{"$f":"IF(AI28<>\"\",IF(H28<>\"\",ABS(24*60*(H28-AI28)),ABS(24*60*(F28-AI28))),0)","v":0},null,{"$f":"IF(AK28<>\"\",IF(E28<>\"\",ABS(24*60*(E28-AK28)),ABS(24*60*(G28-AK28))),0)","v":0},null,{"$f":"IF(AM28<>\"\",IF(H28<>\"\",ABS(24*60*(H28-AM28)),ABS(24*60*(F28-AM28))),0)","v":0},null,null,{"$f":"AQ27+R28-S28","v":0}]
[null,null,"2020-02-16","2020-02-16",null,null,null,null,{"$f":"IF(LEN(F29)+LEN(H29)>0,IF(LEN(H29)>0,(HOUR(F29-E29)+MINUTE(F29-E29)/60)+(HOUR(H29-G29)+MINUTE(H29-G29)/60),(HOUR(F29-E29)+MINUTE(F29-E29)/60)),IF(Parameter!$F$29=1,J29,IF(T29=\"\",0,J29)))","v":0},null,null,null,null,null,null,null,null,{"$f":"IF(I29>J29,I29-J29,0)","v":0},{"$f":"IF(C29<=TODAY(),IF(I29<J29,J29-I29,0),0)","v":0},null,null,null,null,null,null,null,null,null,null,null,null,null,{"$f":"IF(AF29<>\"\",IF(E29<>\"\",ABS(24*60*(E29-AF29)),ABS(24*60*(G29-AF29))),0)","v":0},{"$f":"COUNTA(AF29,AI29,AK29,AM29)","v":0},null,{"$f":"IF(AI29<>\"\",IF(H29<>\"\",ABS(24*60*(H29-AI29)),ABS(24*60*(F29-AI29))),0)","v":0},null,{"$f":"IF(AK29<>\"\",IF(E29<>\"\",ABS(24*60*(E29-AK29)),ABS(24*60*(G29-AK29))),0)","v":0},null,{"$f":"IF(AM29<>\"\",IF(H29<>\"\",ABS(24*60*(H29-AM29)),ABS(24*60*(F29-AM29))),0)","v":0},null,null,{"$f":"AQ28+R29-S29","v":0}]
[null,null,"2020-02-17","2020-02-17",null,null,null,null,{"$f":"IF(LEN(F30)+LEN(H30)>0,IF(LEN(H30)>0,(HOUR(F30-E30)+MINUTE(F30-E30)/60)+(HOUR(H30-G30)+MINUTE(H30-G30)/60),(HOUR(F30-E30)+MINUTE(F30-E30)/60)),IF(Parameter!$F$29=1,J30,IF(T30=\"\",0,J30)))","v":0},null,null,null,null,null,null,null,null,{"$f":"IF(I30>J30,I30-J30,0)","v":0},{"$f":"IF(C30<=TODAY(),IF(I30<J30,J30-I30,0),0)","v":0},null,null,null,null,null,null,null,null,null,null,null,null,null,{"$f":"IF(AF30<>\"\",IF(E30<>\"\",ABS(24*60*(E30-AF30)),ABS(24*60*(G30-AF30))),0)","v":0},{"$f":"COUNTA(AF30,AI30,AK30,AM30)","v":0},null,{"$f":"IF(AI30<>\"\",IF(H30<>\"\",ABS(24*60*(H30-AI30)),ABS(24*60*(F30-AI30))),0)","v":0},null,{"$f":"IF(AK30<>\"\",IF(E30<>\"\",ABS(24*60*(E30-AK30)),ABS(24*60*(G30-AK30))),0)","v":0},null,{"$f":"IF(AM30<>\"\",IF(H30<>\"\",ABS(24*60*(H30-AM30)),ABS(24*60*(F30-AM30))),0)","v":0},null,null,{"$f":"AQ29+R30-S30","v":0}]
[null,null,"2020-02-18","2020-02-18",null,null,null,null,{"$f":"IF(LEN(F31)+LEN(H31)>0,IF(LEN(H31)>0,(HOUR(F31-E31)+MINUTE(F31-E31)/60)+(HOUR(H31-G31)+MINUTE(H31-G31)/60),(HOUR(F31-E31)+MINUTE(F31-E31)/60)),IF(Parameter!$F$29=1,J31,IF(T31=\"\",0,J31)))","v":0},null,null,null,null,null,null,null,null,{"$f":"IF(I31>J31,I31-J31,0)","v":0},{"$f":"IF(C31<=TODAY(),IF(I31<J31,J31-I31,0),0)","v":0},null,null,null,null,null,null,null,null,null,null,null,null,null,{"$f":"IF(AF31<>\"\",IF(E31<>\"\",ABS(24*60*(E31-AF31)),ABS(24*60*(G31-AF31))),0)","v":0},{"$f":"COUNTA(AF31,AI31,AK31,AM31)","v":0},null,{"$f":"IF(AI31<>\"\",IF(H31<>\"\",ABS(24*60*(H31-AI31)),ABS(24*60*(F31-AI31))),0)","v":0},null,{"$f":"IF(AK31<>\"\",IF(E31<>\"\",ABS(24*60*(E31-AK31)),ABS(24*60*(G31-AK31))),0)","v":0},null,{"$f":"IF(AM31<>\"\",IF(H31<>\"\",ABS(24*60*(H31-AM31)),ABS(24*60*(F31-AM31))),0)","v":0},null,null,{"$f":"AQ30+R31-S31","v":0}]
[null,null,"2020-02-19","2020-02-19",null,null,null,null,{"$f":"IF(LEN(F32)+LEN(H32)>0,IF(LEN(H32)>0,(HOUR(F32-E32)+MINUTE(F32-E32)/60)+(HOUR(H32-G32)+MINUTE(H32-G32)/60),(HOUR(F32-E32)+MINUTE(F32-E32)/60)),IF(Parameter!$F$29=1,J32,IF(T32=\"\",0,J32)))","v":0},null,null,null,null,null,null,null,null,{"$f":"IF(I32>J32,I32-J32,0)","v":0},{"$f":"IF(C32<=TODAY(),IF(I32<J32,J32-I32,0),0)","v":0},null,null,null,null,null,null,null,null,null,null,null,null,null,{"$f":"IF(AF32<>\"\",IF(E32<>\"\",ABS(24*60*(E32-AF32)),ABS(24*60*(G32-AF32))),0)","v":0},{"$f":"COUNTA(AF32,AI32,AK32,AM32)","v":0},null,{"$f":"IF(AI32<>\"\",IF(H32<>\"\",ABS(24*60*(H32-AI32)),ABS(24*60*(F32-AI32))),0)","v":0},null,{"$f":"IF(AK32<>\"\",IF(E32<>\"\",ABS(24*60*(E32-AK32)),ABS(24*60*(G32-AK32))),0)","v":0},null,{"$f":"IF(AM32<>\"\",IF(H32<>\"\",ABS(24*60*(H32-AM32)),ABS(24*60*(F32-AM32))),0)","v":0},null,null,{"$f":"AQ31+R32-S32","v":0}]
[null,null,"2020-02-20","2020-02-20",null,null,null,null,{"$f":"IF(LEN(F33)+LEN(H33)>0,IF(LEN(H33)>0,(HOUR(F33-E33)+MINUTE(F33-E33)/60)+(HOUR(H33-G33)+MINUTE(H33-G33)/60),(HOUR(F33-E33)+MINUTE(F33-E33)/60)),IF(Parameter!$F$29=1,J33,IF(T33=\"\",0,J33)))","v":0},null,null,null,null,null,null,null,null,{"$f":"IF(I33>J33,I33-J33,0)","v":0},{"$f":"IF(C33<=TODAY(),IF(I33<J33,J33-I33,0),0)","v":0},null,null,null,null,null,null,null,null,null,null,null,null,null,{"$f":"IF(AF33<>\"\",IF(E33<>\"\",ABS(24*60*(E33-AF33)),ABS(24*60*(G33-AF33))),0)","v":0},{"$f":"COUNTA(AF33,AI33,AK33,AM33)","v":0},null,{"$f":"IF(AI33<>\"\",IF(H33<>\"\",ABS(24*60*(H33-AI33)),ABS(24*60*(F33-AI33))),0)","v":0},null,{"$f":"IF(AK33<>\"\",IF(E33<>\"\",ABS(24*60*(E33-AK33)),ABS(24*60*(G33-AK33))),0)","v":0},null,{"$f":"IF(AM33<>\"\",IF(H33<>\"\",ABS(24*60*(H33-AM33)),ABS(24*60*(F33-AM33))),0)","v":0},null,null,{"$f":"AQ32+R33-S33","v":0}]
[null,null,"2020-02-21","2020-02-21",null,null,null,null,{"$f":"IF(LEN(F34)+LEN(H34)>0,IF(LEN(H34)>0,(HOUR(F34-E34)+MINUTE(F34-E34)/60)+(HOUR(H34-G34)+MINUTE(H34-G34)/60),(HOUR(F34-E34)+MINUTE(F34-E34)/60)),IF(Parameter!$F$29=1,J34,IF(T34=\"\",0,J34)))","v":0},null,null,null,null,null,null,null,null,{"$f":"IF(I34>J34,I34-J34,0)","v":0},{"$f":"IF(C34<=TODAY(),IF(I34<J34,J34-I34,0),0)","v":0},null,null,null,null,null,null,null,null,null,null,null,null,null,{"$f":"IF(AF34<>\"\",IF(E34<>\"\",ABS(24*60*(E34-AF34)),ABS(24*60*(G34-AF34))),0)","v":0},{"$f":"COUNTA(AF34,AI34,AK34,AM34)","v":0},null,{"$f":"IF(AI34<>\"\",IF(H34<>\"\",ABS(24*60*(H34-AI34)),ABS(24*60*(F34-AI34))),0)","v":0},null,{"$f":"IF(AK34<>\"\",IF(E34<>\"\",ABS(24*60*(E34-AK34)),ABS(24*60*(G34-AK34))),0)","v":0},null,{"$f":"IF(AM34<>\"\",IF(H34<>\"\",ABS(24*60*(H34-AM34)),ABS(24*60*(F34-AM34))),0)","v":0},null,null,{"$f":"AQ33+R34-S34","v":0}]
[null,null,"2020-02-22","2020-02-22",null,null,null,null,{"$f":"IF(LEN(F35)+LEN(H35)>0,IF(LEN(H35)>0,(HOUR(F35-E35)+MINUTE(F35-E35)/60)+(HOUR(H35-G35)+MINUTE(H35-G35)/60),(HOUR(F35-E35)+MINUTE(F35-E35)/60)),IF(Parameter!$F$29=1,J35,IF(T35=\"\",0,J35)))","v":0},null,null,null,null,null,null,null,null,{"$f":"IF(I35>J35,I35-J35,0)","v":0},{"$f":"IF(C35<=TODAY(),IF(I35<J35,J35-I35,0),0)","v":0},null,null,null,null,null,null,null,null,null,null,null,null,null,{"$f":"IF(AF35<>\"\",IF(E35<>\"\",ABS(24*60*(E35-AF35)),ABS(24*60*(G35-AF35))),0)","v":0},{"$f":"COUNTA(AF35,AI35,AK35,AM35)","v":0},null,{"$f":"IF(AI35<>\"\",IF(H35<>\"\",ABS(24*60*(H35-AI35)),ABS(24*60*(F35-AI35))),0)","v":0},null,{"$f":"IF(AK35<>\"\",IF(E35<>\"\",ABS(24*60*(E35-AK35)),ABS(24*60*(G35-AK35))),0)","v":0},null,{"$f":"IF(AM35<>\"\",IF(H35<>\"\",ABS(24*60*(H35-AM35)),ABS(24*60*(F35-AM35))),0)","v":0},null,null,{"$f":"AQ34+R35-S35","v":0}]
[null,null,"2020-02-23","2020-02-23",null,null,null,null,{"$f":"IF(LEN(F36)+LEN(H36)>0,IF(LEN(H36)>0,(HOUR(F36-E36)+MINUTE(F36-E36)/60)+(HOUR(H36-G36)+MINUTE(H36-G36)/60),(HOUR(F36-E36)+MINUTE(F36-E36)/60)),IF(Parameter!$F$29=1,J36,IF(T36=\"\",0,J36)))","v":0},null,null,null,null,null,null,null,null,{"$f":"IF(I36>J36,I36-J36,0)","v":0},{"$f":"IF(C36<=TODAY(),IF(I36<J36,J36-I36,0),0)","v":0},null,null,null,null,null,null,null,null,null,null,null,null,null,{"$f":"IF(AF36<>\"\",IF(E36<>\"\",ABS(24*60*(E36-AF36)),ABS(24*60*(G36-AF36))),0)","v":0},{"$f":"COUNTA(AF36,AI36,AK36,AM36)","v":0},null,{"$f":"IF(AI36<>\"\",IF(H36<>\"\",ABS(24*60*(H36-AI36)),ABS(24*60*(F36-AI36))),0)","v":0},null,{"$f":"IF(AK36<>\"\",IF(E36<>\"\",ABS(24*60*(E36-AK36)),ABS(24*60*(G36-AK36))),0)","v":0},null,{"$f":"IF(AM36<>\"\",IF(H36<>\"\",ABS(24*60*(H36-AM36)),ABS(24*60*(F36-AM36))),0)","v":0},null,null,{"$f":"AQ35+R36-S36","v":0}]
[null,null,"2020-02-24","2020-02-24",null,null,null,null,{"$f":"IF(LEN(F37)+LEN(H37)>0,IF(LEN(H37)>0,(HOUR(F37-E37)+MINUTE(F37-E37)/60)+(HOUR(H37-G37)+MINUTE(H37-G37)/60),(HOUR(F37-E37)+MINUTE(F37-E37)/60)),IF(Parameter!$F$29=1,J37,IF(T37=\"\",0,J37)))","v":0},null,null,null,null,null,null,null,null,{"$f":"IF(I37>J37,I37-J37,0)","v":0},{"$f":"IF(C37<=TODAY(),IF(I37<J37,J37-I37,0),0)","v":0},null,null,null,null,null,null,null,null,null,null,null,null,null,{"$f":"IF(AF37<>\"\",IF(E37<>\"\",ABS(24*60*(E37-AF37)),ABS(24*60*(G37-AF37))),0)","v":0},{"$f":"COUNTA(AF37,AI37,AK37,AM37)","v":0},null,{"$f":"IF(AI37<>\"\",IF(H37<>\"\",ABS(24*60*(H37-AI37)),ABS(24*60*(F37-AI37))),0)","v":0},null,{"$f":"IF(AK37<>\"\",IF(E37<>\"\",ABS(24*60*(E37-AK37)),ABS(24*60*(G37-AK37))),0)","v":0},null,{"$f":"IF(AM37<>\"\",IF(H37<>\"\",ABS(24*60*(H37-AM37)),ABS(24*60*(F37-AM37))),0)","v":0},null,null,{"$f":"AQ36+R37-S37","v":0}]
[null,null,"2020-02-25","2020-02-25",null,null,null,null,{"$f":"IF(LEN(F38)+LEN(H38)>0,IF(LEN(H38)>0,(HOUR(F38-E38)+MINUTE(F38-E38)/60)+(HOUR(H38-G38)+MINUTE(H38-G38)/60),(HOUR(F38-E38)+MINUTE(F38-E38)/60)),IF(Parameter!$F$29=1,J38,IF(T38=\"\",0,J38)))","v":0},null,null,null,null,null,null,null,null,{"$f":"IF(I38>J38,I38-J38,0)","v":0},{"$f":"IF(C38<=TODAY(),IF(I38<J38,J38-I38,0),0)","v":0},null,null,null,null,null,null,null,null,null,null,null,null,null,{"$f":"IF(AF38<>\"\",IF(E38<>\"\",ABS(24*60*(E38-AF38)),ABS(24*60*(G38-AF38))),0)","v":0},{"$f":"COUNTA(AF38,AI38,AK38,AM38)","v":0},null,{"$f":"IF(AI38<>\"\",IF(H38<>\"\",ABS(24*60*(H38-AI38)),ABS(24*60*(F38-AI38))),0)","v":0},null,{"$f":"IF(AK38<>\"\",IF(E38<>\"\",ABS(24*60*(E38-AK38)),ABS(24*60*(G38-AK38))),0)","v":0},null,{"$f":"IF(AM38<>\"\",IF(H38<>\"\",ABS(24*60*(H38-AM38)),ABS(24*60*(F38-AM38))),0)","v":0},null,null,{"$f":"AQ37+R38-S38","v":0}]
[null,null,"2020-02-26","2020-02-26",null,null,null,null,{"$f":"IF(LEN(F39)+LEN(H39)>0,IF(LEN(H39)>0,(HOUR(F39-E39)+MINUTE(F39-E39)/60)+(HOUR(H39-G39)+MINUTE(H39-G39)/60),(HOUR(F39-E39)+MINUTE(F39-E39)/60)),IF(Parameter!$F$29=1,J39,IF(T39=\"\",0,J39)))","v":0},null,null,null,null,null,null,null,null,{"$f":"IF(I39>J39,I39-J39,0)","v":0},{"$f":"IF(C39<=TODAY(),IF(I39<J39,J39-I39,0),0)","v":0},null,null,null,null,null,null,null,null,null,null,null,null,null,{"$f":"IF(AF39<>\"\",IF(E39<>\"\",ABS(24*60*(E39-AF39)),ABS(24*60*(G39-AF39))),0)","v":0},{"$f":"COUNTA(AF39,AI39,AK39,AM39)","v":0},null,{"$f":"IF(AI39<>\"\",IF(H39<>\"\",ABS(24*60*(H39-AI39)),ABS(24*60*(F39-AI39))),0)","v":0},null,{"$f":"IF(AK39<>\"\",IF(E39<>\"\",ABS(24*60*(E39-AK39)),ABS(24*60*(G39-AK39))),0)","v":0},null,{"$f":"IF(AM39<>\"\",IF(H39<>\"\",ABS(24*60*(H39-AM39)),ABS(24*60*(F39-AM39))),0)","v":0},null,null,{"$f":"AQ38+R39-S39","v":0}]
[null,null,"2020-02-27","2020-02-27",null,null,null,null,{"$f":"IF(LEN(F40)+LEN(H40)>0,IF(LEN(H40)>0,(HOUR(F40-E40)+MINUTE(F40-E40)/60)+(HOUR(H40-G40)+MINUTE(H40-G40)/60),(HOUR(F40-E40)+MINUTE(F40-E40)/60)),IF(Parameter!$F$29=1,J40,IF(T40=\"\",0,J40)))","v":0},null,null,null,null,null,null,null,null,{"$f":"IF(I40>J40,I40-J40,0)","v":0},{"$f":"IF(C40<=TODAY(),IF(I40<J40,J40-I40,0),0)","v":0},null,null,null,null,null,null,null,null,null,null,null,null,null,{"$f":"IF(AF40<>\"\",IF(E40<>\"\",ABS(24*60*(E40-AF40)),ABS(24*60*(G40-AF40))),0)","v":0},{"$f":"COUNTA(AF40,AI40,AK40,AM40)","v":0},null,{"$f":"IF(AI40<>\"\",IF(H40<>\"\",ABS(24*60*(H40-AI40)),ABS(24*60*(F40-AI40))),0)","v":0},null,{"$f":"IF(AK40<>\"\",IF(E40<>\"\",ABS(24*60*(E40-AK40)),ABS(24*60*(G40-AK40))),0)","v":0},null,{"$f":"IF(AM40<>\"\",IF(H40<>\"\",ABS(24*60*(H40-AM40)),ABS(24*60*(F40-AM40))),0)","v":0},null,null,{"$f":"AQ39+R40-S40","v":0}]
[null,null,"2020-02-28","2020-02-28",null,null,null,null,{"$f":"IF(LEN(F41)+LEN(H41)>0,IF(LEN(H41)>0,(HOUR(F41-E41)+MINUTE(F41-E41)/60)+(HOUR(H41-G41)+MINUTE(H41-G41)/60),(HOUR(F41-E41)+MINUTE(F41-E41)/60)),IF(Parameter!$F$29=1,J41,IF(T41=\"\",0,J41)))","v":0},null,null,null,null,null,null,null,null,{"$f":"IF(I41>J41,I41-J41,0)","v":0},{"$f":"IF(C41<=TODAY(),IF(I41<J41,J41-I41,0),0)","v":0},null,null,null,null,null,null,null,null,null,null,null,null,null,{"$f":"IF(AF41<>\"\",IF(E41<>\"\",ABS(24*60*(E41-AF41)),ABS(24*60*(G41-AF41))),0)","v":0},{"$f":"COUNTA(AF41,AI41,AK41,AM41)","v":0},null,{"$f":"IF(AI41<>\"\",IF(H41<>\"\",ABS(24*60*(H41-AI41)),ABS(24*60*(F41-AI41))),0)","v":0},null,{"$f":"IF(AK41<>\"\",IF(E41<>\"\",ABS(24*60*(E41-AK41)),ABS(24*60*(G41-AK41))),0)","v":0},null,{"$f":"IF(AM41<>\"\",IF(H41<>\"\",ABS(24*60*(H41-AM41)),ABS(24*60*(F41-AM41))),0)","v":0},null,null,{"$f":"AQ40+R41-S41","v":0}]
[null,null,"2020-02-29","2020-02-29",null,null,null,null,{"$f":"IF(LEN(F42)+LEN(H42)>0,IF(LEN(H42)>0,(HOUR(F42-E42)+MINUTE(F42-E42)/60)+(HOUR(H42-G42)+MINUTE(H42-G42)/60),(HOUR(F42-E42)+MINUTE(F42-E42)/60)),IF(Parameter!$F$29=1,J42,IF(T42=\"\",0,J42)))","v":0},null,null,null,null,null,null,null,null,{"$f":"IF(I42>J42,I42-J42,0)","v":0},{"$f":"IF(C42<=TODAY(),IF(I42<J42,J42-I42,0),0)","v":0},null,null,null,null,null,null,null,null,null,null,null,null,null,{"$f":"IF(AF42<>\"\",IF(E42<>\"\",ABS(24*60*(E42-AF42)),ABS(24*60*(G42-AF42))),0)","v":0},{"$f":"COUNTA(AF42,AI42,AK42,AM42)","v":0},null,{"$f":"IF(AI42<>\"\",IF(H42<>\"\",ABS(24*60*(H42-AI42)),ABS(24*60*(F42-AI42))),0)","v":0},null,{"$f":"IF(AK42<>\"\",IF(E42<>\"\",ABS(24*60*(E42-AK42)),ABS(24*60*(G42-AK42))),0)","v":0},null,{"$f":"IF(AM42<>\"\",IF(H42<>\"\",ABS(24*60*(H42-AM42)),ABS(24*60*(F42-AM42))),0)","v":0},null,null,{"$f":"AQ41+R42-S42","v":0}]
[null,null,{"$f":"IF(MONTH(C14)<>2,IF(MONTH(C42+1)>MONTH(C42),\"\",C42+1),\"\")","v":""},"",null,null,null,null,{"$f":"IF(LEN(F43)+LEN(H43)>0,IF(LEN(H43)>0,(HOUR(F43-E43)+MINUTE(F43-E43)/60)+(HOUR(H43-G43)+MINUTE(H43-G43)/60),(HOUR(F43-E43)+MINUTE(F43-E43)/60)),IF(Parameter!$F$29=1,J43,IF(T43=\"\",0,J43)))","v":0},null,null,null,null,null,null,null,null,{"$f":"IF(I43>J43,I43-J43,0)","v":0},{"$f":"IF(C43<=TODAY(),IF(I43<J43,J43-I43,0),0)","v":0},null,null,null,null,null,null,null,null,null,null,null,null,null,{"$f":"IF(AF43<>\"\",IF(E43<>\"\",ABS(24*60*(E43-AF43)),ABS(24*60*(G43-AF43))),0)","v":0},{"$f":"COUNTA(AF43,AI43,AK43,AM43)","v":0},null,{"$f":"IF(AI43<>\"\",IF(H43<>\"\",ABS(24*60*(H43-AI43)),ABS(24*60*(F43-AI43))),0)","v":0},null,{"$f":"IF(AK43<>\"\",IF(E43<>\"\",ABS(24*60*(E43-AK43)),ABS(24*60*(G43-AK43))),0)","v":0},null,{"$f":"IF(AM43<>\"\",IF(H43<>\"\",ABS(24*60*(H43-AM43)),ABS(24*60*(F43-AM43))),0)","v":0},null,null,{"$f":"AQ42+R43-S43","v":0}]
[null,null,{"$f":"IF(MONTH(C14)<>2,IF(MONTH(C43+1)>MONTH(C43),\"\",C43+1),\"\")","v":""},"",null,null,null,null,{"$f":"IF(LEN(F44)+LEN(H44)>0,IF(LEN(H44)>0,(HOUR(F44-E44)+MINUTE(F44-E44)/60)+(HOUR(H44-G44)+MINUTE(H44-G44)/60),(HOUR(F44-E44)+MINUTE(F44-E44)/60)),IF(Parameter!$F$29=1,J44,IF(T44=\"\",0,J44)))","v":0},null,null,null,null,null,null,null,null,{"$f":"IF(I44>J44,I44-J44,0)","v":0},{"$f":"IF(C44<=TODAY(),IF(I44<J44,J44-I44,0),0)","v":0},null,null,null,null,null,null,null,null,null,null,null,null,null,{"$f":"IF(AF44<>\"\",IF(E44<>\"\",ABS(24*60*(E44-AF44)),ABS(24*60*(G44-AF44))),0)","v":0},{"$f":"COUNTA(AF44,AI44,AK44,AM44)","v":0},null,{"$f":"IF(AI44<>\"\",IF(H44<>\"\",ABS(24*60*(H44-AI44)),ABS(24*60*(F44-AI44))),0)","v":0},null,{"$f":"IF(AK44<>\"\",IF(E44<>\"\",ABS(24*60*(E44-AK44)),ABS(24*60*(G44-AK44))),0)","v":0},null,{"$f":"IF(AM44<>\"\",IF(H44<>\"\",ABS(24*60*(H44-AM44)),ABS(24*60*(F44-AM44))),0)","v":0},null,null,{"$f":"AQ43+R44-S44","v":0}]
[null,null,null,null,null,null,null,"Summe:",{"$f":"ROUND(SUM(I14:I44),2)","v":0},{"$f":"ROUND(SUM(J13:J44),2)","v":0},{"$f":"SUM(K14:K44)","v":0},0,0,0,0,0,0,{"$f":"ROUND(SUM(R14:R44),2)","v":0},{"$f":"ROUND(SUM(S14:S44),2)","v":0},{"$f":"IF(COUNTA(T14:T44)=0,\"\",\"/U:\" & COUNTIF(T14:T44,\"u\")&\"/K:\" & COUNTIF(T14:T44,\"k\")&\"/Rest:\" & COUNTA(T14:T44)-COUNTIF(T14:T44,\"u\")-COUNTIF(T14:T44,\"k\"))","v":""},null,null,"Kontrollsummen:",null,null,null,null,null,null,null,null,null,null,null,null,null,null,null,null,null,null,null,null,{"$f":"SUM(AR14:AR44)","v":0},0,0,0,null,0,0,null,"Durchschnitt"]
[null,null,null,null,null,null,null,null,null,null,null,null,null,null,null,null,null,{"$f":"ROUND(R45-S45,2)","v":0},null,"Monatssaldo",null,null,{"$f":"\"IST-Stunden \"&ISTsumme&\" - SOLL-Stunden \"&SOLLsumme&\" =\"","v":"IST-Stunden 0 - SOLL-Stunden 0 ="},null,null,{"$f":"ISTsumme-SOLLsumme","v":0},null,null,null,null,null,null,null,null,null,null,null,null,null,null,null,null,null,null,null,null,null,null,null,null,null,{"$f":"IFERROR(SUM(AZ14:AZ44)/COUNTA(AZ14:AZ44),\"\")","v":""}]
[null,null,"Über-/Mehrstunden",null,null,{"$f":"ROUND(AT45+AU45,2)","v":0},"korr.Endsaldo inkl.Vorperiode:",null,null,null,null,null,null,null,null,null,null,{"$f":"ROUND(R9+R46,2)+F48","v":0},null,"Endsaldo inkl.Vorperiode",null,null,{"$f":"IF(M45<>0,\"minus automatische Überstunden:\",\"Monatssaldo (Zelle R46):\")","v":"Monatssaldo (Zelle R46):"},null,null,{"$f":"IF(M45<>0,-M45,R46)","v":0}]
[null,null,"Zeitsaldo Korrektur",null,null,{"$f":"ROUND((AS45-AT45),2)","v":0},null,null,null,null,null,null,null,null,null,null,null,null,null,"Auszahlung Gutstunden",null,null,{"$f":"IF(M45<>0,\"=Monatssaldo (Zelle R46):\",\"Differenz =\")","v":"Differenz ="},null,null,{"$f":"IF(M45<>0,(Z46+Z47),ROUND(Z46-Z47,1))","v":0}]
[null,null,"Info Lohn: ",null,null,null,null,null,null,null,null,null,null,null,null,null,null,{"$f":"R47-R48","v":0},null,"Vortrag abzgl.Auszahlg.",null,null,{"$f":"IF(M45<>0,\"Differenz =\",\"\")","v":""},null,null,{"$f":"IF(M45<>0,ROUND(Z48-R46,1),\"\")","v":""}]

{"sheet":"3 MAR","index":5,"n_rows":49,"n_cols":75,"rows_kept":49,"cut":false,"hidden":false,"merged":[[2,30,2,32],[2,34,2,35],[2,37,2,38],[11,34,11,35],[11,37,11,38],[10,51,12,51],[47,17,47,18],[46,17,46,18],[45,17,45,18],[10,49,12,49],[44,19,44,20],[47,19,47,21],[47,22,47,24],[45,22,45,24],[10,48,12,48],[10,47,12,47],[46,22,46,24],[45,19,45,21],[46,19,46,21],[10,50,12,50],[10,44,12,44],[10,45,12,45],[10,46,12,46],[10,15,12,15],[5,17,7,18],[10,11,12,11],[7,14,8,14],[7,15,8,15],[10,13,12,13],[10,16,12,16],[10,42,12,42],[10,43,12,43],[11,17,11,18],[11,22,12,22],[5,27,6,27],[11,25,11,26],[5,22,5,24],[0,22,0,26],[2,2,2,18],[10,19,12,19],[10,3,11,3],[8,17,8,18],[10,20,12,20],[5,5,5,8],[6,26,7,26],[8,2,8,3],[8,4,8,8],[11,6,11,7],[5,10,5,13],[7,12,8,12],[7,4,7,8],[8,26,9,26],[11,23,11,24],[48,22,48,24],[5,16,6,16],[48,19,48,21],[48,2,48,3],[48,4,48,9],[48,17,48,18],[7,16,8,16],[10,10,12,10],[10,12,12,12],[10,14,12,14],[11,4,11,5],[7,10,8,10],[7,13,8,13],[10,8,11,9],[5,2,5,4],[10,22,10,26],[46,2,46,4],[47,2,47,4],[7,2,7,3],[7,11,8,11],[45,8,45,9],[47,6,47,9],[46,6,46,16],[47,10,47,13],[47,14,47,16],[10,2,11,2],[10,4,10,7],[2,74,11,74],[2,69,11,69],[2,70,11,70],[2,71,11,71],[2,72,11,72],[2,73,11,73]]}
[]
[]
[null,null,null,null,null,null,null,null,null,null,null,null,null,null,null,null,null,null,null,null,null,null,null,null,null,null,null,null,null,null,null,null,null,null,null,null,null,null,null,null,null,null,null,null,null,null,null,null,null,null,null,null,null,null,null,null,null,null,null,null,null,null,null,null,null,null,null,null,null,{"$f":"IF(AND(Parameter!B69<>\"\"),Parameter!B69&\" \"&Parameter!E69&\"%\",\"\")","v":"Zuschlag vor DP-Beginn 25%"},{"$f":"IF(AND(Parameter!E70<>\"\",Parameter!F70<>\"\"),Parameter!B70&\" \"&TEXT(Parameter!F70,\"hh:mm\")&\" \"&Parameter!E70&\"%\",\"\")","v":"Zuschlag innerhalb DP \nnach 1.Uhrzeit 19:30 50%"},{"$f":"Parameter!B71&\" \"&TEXT(Parameter!F71,\"hh:mm\")&\" \"&Parameter!E71&\"%\"","v":"Zuschlag innerhalb DP \nnach 2.Uhrzeit 21:00 75%"},{"$f":"Parameter!B72&\" \"&TEXT(Parameter!F72,\"hh:mm\")&\" \"&Parameter!E72&\"%\"","v":"Zuschlag außerhalb DP \nnach 1.Uhrzeit 19:30 100%"},{"$f":"Parameter!B73&\" \"&TEXT(Parameter!F73,\"hh:mm\")&\" \"&Parameter!E73&\"%\"","v":"Zuschlag außerhalb DP \nnach 2.Uhrzeit 21:00 125%"},{"$f":"IF(AND(Parameter!B74<>\"\"),Parameter!B74&\" \"&Parameter!E74&\"%\",\"\")","v":"Zuschlag nach DP-Ende 150%"}]
[]
[]
[null,null,"Monat",null,null,{"$f":"MonatsErster+60","v":"2020-03-01"},null,null,null,null,"täglich",null,null,null,"So/Feier","Woche",{"$f":"IF(LEFT(Parameter!J62,1)=\"1\",\"Manuell\",\"Morgen Zeit\")","v":"Manuell"},"Vortrag\nVormonat"]
[]
[null,null,"MitarbeitNr.",null,{"$f":"IF('1 JAN'!E8<>\"\",'1 JAN'!E8,\"\")","v":""},null,null,null,null,null,{"$f":"Parameter!Q50","v":">21:00   100% Üh   "},{"$f":"Parameter!Q52","v":">19:30   50% Üh   "},{"$f":"Parameter!Q54","v":">9h                 50% Üh   "},{"$f":"Parameter!Q56","v":"> Soll-h bis 9 Std.                    50% Üh   "},{"$f":"Parameter!Q58","v":"So/Feiert 100% Üh   "},{"$f":"Parameter!Q60","v":">39h      100% Üh   "},{"$f":"Parameter!Q62","v":"manuell    50% Mh   "}]
[null,null,"Name:",null,{"$f":"IF('1 JAN'!E9<>\"\",'1 JAN'!E9,\"\")","v":""},null,null,null,null,null,null,null,null,null,null,null,null,{"$f":"IF(Parameter!F34=TRUE,'2 FEB'!R49:S49,0)","v":0}]
[null,null,null,{"$f":"IF(D16=\"Fr\",\"JA\",\"\")","v":""}]
[null,null,"Datum","Tag","tatsächliche Arbeitszeit",null,null,null," Gesamt\nStunden",null,{"$f":"MID(Parameter!F50,3,99)","v":"Grund-Stunde ZA - Zuschlag auszahlen"},{"$f":"MID(Parameter!F52,3,99)","v":"Grund-Stunde ZA - Zuschlag auszahlen"},{"$f":"MID(Parameter!F54,3,99)","v":"Grund-Stunde ZA - Zuschlag auszahlen"},{"$f":"MID(Parameter!F56,3,99)","v":"Grund-Stunde ZA - Zuschlag auszahlen"},{"$f":"MID(Parameter!F58,3,99)","v":"Grund-Stunde ZA - Zuschlag auszahlen"},{"$f":"MID(Parameter!F60,3,99)","v":"Grund-Stunde ZA - Zuschlag auszahlen"},{"$f":"MID(Parameter!F62,3,99)","v":"Grund-Stunde ZA - Zuschlag auszahlen"},"Gut-","Minus-"," Urlaub\nKrank\n\nU oder K \nmachen","Feiertag\n\nF-ix\nB-ewegl.",null,{"$f":"IF(AND(UPPER(Parameter!G68=\"AKTIV\"),UPPER(Parameter!R69=\"AKTIV\")),\"Dienstplan-Vorschlag übernehmen\",IF(UPPER(Parameter!G68=\"AKTIV\"),\"Dienstplan\",\"Manuelle Zeiterfassung\"))","v":"Manuelle Zeiterfassung"},null,null,null,null,null,null,null,null,null,null,null,null,null,null,null,null,null,null,null,"Aktueller\nTages\nSaldo","Summe Grundstunden\nim Zeitsaldo","Summe \nZuschlag \nZeitsaldo \nerhöhend","Summe Grundstunden\nzur Auszahlung","Summe \nZuschlag\nzur Auszahlung","Korrigierter Tagessaldo","Korrigierte \nTages IST-Std","Differenz SOLL-Std zu IST-Std inkl. Zeitsaldo Korrekturen","Tagesstunden + sonntags Summe Wochen-\nStunden","Wochen\nsumme \n(korrigiert)"]
[null,null,null,null,"Vormittag",null,"Nachmittag",null,null,null,null,null,null,null,null,null,null,"Stunden",null,null,null,null,{"$f":"IF(UPPER(Parameter!G68)=\"AKTIV\",\"Manuelle Zeiten in Spalte W sind monatlich manuell in die Spalten E-H zu übernehmen\",\"Begründung manuelle Zeiterfassung\")","v":"Begründung manuelle Zeiterfassung"},"Vormittag",null,"Nachmittag"]
[null,"OK",null,null,"von","bis","von","bis","Ist","Soll",null,null,null,null,null,null,null,"+","-",null,null,null,null,"von","bis","von","bis",null,null,null,"Anmerkung","Internet AN Vorm.","Differenz","Anzahl Internetzeiten","Internet AB Vorm","Differenz","Internet AN Nachm.","Differenz","Internet AB Nachm.","Differenz",null,null,null,null,null,null,null,null,null,null,null,null,null,null,null,null,null,null,null,null,null,null,null,null,null,null,null,null,null,{"$f":"SUM(BR14:BR44)","v":0},0,0,0,0,0]
[null,null,{"$f":"DATE('1 JAN'!G2,3,1)","v":"2020-03-01"},{"$f":"C14","v":"2020-03-01"},null,null,null,null,{"$f":"IF(LEN(F14)+LEN(H14)>0,IF(LEN(H14)>0,(HOUR(F14-E14)+MINUTE(F14-E14)/60)+(HOUR(H14-G14)+MINUTE(H14-G14)/60),(HOUR(F14-E14)+MINUTE(F14-E14)/60)),IF(Parameter!$F$29=1,J14,IF(T14=\"\",0,J14)))","v":0},null,null,null,null,null,null,null,null,{"$f":"IF(I14>J14,I14-J14,0)","v":0},{"$f":"IF(C14<=TODAY(),IF(I14<J14,J14-I14,0),0)","v":0},null,null,null,null,null,null,null,null,null,null,null,null,null,{"$f":"IF(AF14<>\"\",IF(E14<>\"\",ABS(24*60*(E14-AF14)),ABS(24*60*(G14-AF14))),0)","v":0},{"$f":"COUNTA(AF14,AI14,AK14,AM14)","v":0},null,{"$f":"IF(AI14<>\"\",IF(H14<>\"\",ABS(24*60*(H14-AI14)),ABS(24*60*(F14-AI14))),0)","v":0},null,{"$f":"IF(AK14<>\"\",IF(E14<>\"\",ABS(24*60*(E14-AK14)),ABS(24*60*(G14-AK14))),0)","v":0},null,{"$f":"IF(AM14<>\"\",IF(H14<>\"\",ABS(24*60*(H14-AM14)),ABS(24*60*(F14-AM14))),0)","v":0},null,null,{"$f":"R9+R14-S14","v":0}]
[null,null,{"$f":"IF(MONTH(C14+1)>MONTH(C14),\"\",C14+1)","v":"2020-03-02"},"2020-03-02",null,null,null,null,{"$f":"IF(LEN(F15)+LEN(H15)>0,IF(LEN(H15)>0,(HOUR(F15-E15)+MINUTE(F15-E15)/60)+(HOUR(H15-G15)+MINUTE(H15-G15)/60),(HOUR(F15-E15)+MINUTE(F15-E15)/60)),IF(Parameter!$F$29=1,J15,IF(T15=\"\",0,J15)))","v":0},null,null,null,null,null,null,null,null,{"$f":"IF(I15>J15,I15-J15,0)","v":0},{"$f":"IF(C15<=TODAY(),IF(I15<J15,J15-I15,0),0)","v":0},null,null,null,null,null,null,null,null,null,null,null,null,null,{"$f":"IF(AF15<>\"\",IF(E15<>\"\",ABS(24*60*(E15-AF15)),ABS(24*60*(G15-AF15))),0)","v":0},{"$f":"COUNTA(AF15,AI15,AK15,AM15)","v":0},null,{"$f":"IF(AI15<>\"\",IF(H15<>\"\",ABS(24*60*(H15-AI15)),ABS(24*60*(F15-AI15))),0)","v":0},null,{"$f":"IF(AK15<>\"\",IF(E15<>\"\",ABS(24*60*(E15-AK15)),ABS(24*60*(G15-AK15))),0)","v":0},null,{"$f":"IF(AM15<>\"\",IF(H15<>\"\",ABS(24*60*(H15-AM15)),ABS(24*60*(F15-AM15))),0)","v":0},null,null,{"$f":"AQ14+R15-S15","v":0}]
[null,null,"2020-03-03","2020-03-03",null,null,null,null,{"$f":"IF(LEN(F16)+LEN(H16)>0,IF(LEN(H16)>0,(HOUR(F16-E16)+MINUTE(F16-E16)/60)+(HOUR(H16-G16)+MINUTE(H16-G16)/60),(HOUR(F16-E16)+MINUTE(F16-E16)/60)),IF(Parameter!$F$29=1,J16,IF(T16=\"\",0,J16)))","v":0},null,null,null,null,null,null,null,null,{"$f":"IF(I16>J16,I16-J16,0)","v":0},{"$f":"IF(C16<=TODAY(),IF(I16<J16,J16-I16,0),0)","v":0},null,null,null,null,null,null,null,null,null,null,null,null,null,{"$f":"IF(AF16<>\"\",IF(E16<>\"\",ABS(24*60*(E16-AF16)),ABS(24*60*(G16-AF16))),0)","v":0},{"$f":"COUNTA(AF16,AI16,AK16,AM16)","v":0},null,{"$f":"IF(AI16<>\"\",IF(H16<>\"\",ABS(24*60*(H16-AI16)),ABS(24*60*(F16-AI16))),0)","v":0},null,{"$f":"IF(AK16<>\"\",IF(E16<>\"\",ABS(24*60*(E16-AK16)),ABS(24*60*(G16-AK16))),0)","v":0},null,{"$f":"IF(AM16<>\"\",IF(H16<>\"\",ABS(24*60*(H16-AM16)),ABS(24*60*(F16-AM16))),0)","v":0},null,null,{"$f":"AQ15+R16-S16","v":0}]
[null,null,"2020-03-04","2020-03-04",null,null,null,null,{"$f":"IF(LEN(F17)+LEN(H17)>0,IF(LEN(H17)>0,(HOUR(F17-E17)+MINUTE(F17-E17)/60)+(HOUR(H17-G17)+MINUTE(H17-G17)/60),(HOUR(F17-E17)+MINUTE(F17-E17)/60)),IF(Parameter!$F$29=1,J17,IF(T17=\"\",0,J17)))","v":0},null,null,null,null,null,null,null,null,{"$f":"IF(I17>J17,I17-J17,0)","v":0},{"$f":"IF(C17<=TODAY(),IF(I17<J17,J17-I17,0),0)","v":0},null,null,null,null,null,null,null,null,null,null,null,null,null,{"$f":"IF(AF17<>\"\",IF(E17<>\"\",ABS(24*60*(E17-AF17)),ABS(24*60*(G17-AF17))),0)","v":0},{"$f":"COUNTA(AF17,AI17,AK17,AM17)","v":0},null,{"$f":"IF(AI17<>\"\",IF(H17<>\"\",ABS(24*60*(H17-AI17)),ABS(24*60*(F17-AI17))),0)","v":0},null,{"$f":"IF(AK17<>\"\",IF(E17<>\"\",ABS(24*60*(E17-AK17)),ABS(24*60*(G17-AK17))),0)","v":0},null,{"$f":"IF(AM17<>\"\",IF(H17<>\"\",ABS(24*60*(H17-AM17)),ABS(24*60*(F17-AM17))),0)","v":0},null,null,{"$f":"AQ16+R17-S17","v":0}]
[null,null,"2020-03-05","2020-03-05",null,null,null,null,{"$f":"IF(LEN(F18)+LEN(H18)>0,IF(LEN(H18)>0,(HOUR(F18-E18)+MINUTE(F18-E18)/60)+(HOUR(H18-G18)+MINUTE(H18-G18)/60),(HOUR(F18-E18)+MINUTE(F18-E18)/60)),IF(Parameter!$F$29=1,J18,IF(T18=\"\",0,J18)))","v":0},null,null,null,null,null,null,null,null,{"$f":"IF(I18>J18,I18-J18,0)","v":0},{"$f":"IF(C18<=TODAY(),IF(I18<J18,J18-I18,0),0)","v":0},null,null,null,null,null,null,null,null,null,null,null,null,null,{"$f":"IF(AF18<>\"\",IF(E18<>\"\",ABS(24*60*(E18-AF18)),ABS(24*60*(G18-AF18))),0)","v":0},{"$f":"COUNTA(AF18,AI18,AK18,AM18)","v":0},null,{"$f":"IF(AI18<>\"\",IF(H18<>\"\",ABS(24*60*(H18-AI18)),ABS(24*60*(F18-AI18))),0)","v":0},null,{"$f":"IF(AK18<>\"\",IF(E18<>\"\",ABS(24*60*(E18-AK18)),ABS(24*60*(G18-AK18))),0)","v":0},null,{"$f":"IF(AM18<>\"\",IF(H18<>\"\",ABS(24*60*(H18-AM18)),ABS(24*60*(F18-AM18))),0)","v":0},null,null,{"$f":"AQ17+R18-S18","v":0}]
[null,null,"2020-03-06","2020-03-06",null,null,null,null,{"$f":"IF(LEN(F19)+LEN(H19)>0,IF(LEN(H19)>0,(HOUR(F19-E19)+MINUTE(F19-E19)/60)+(HOUR(H19-G19)+MINUTE(H19-G19)/60),(HOUR(F19-E19)+MINUTE(F19-E19)/60)),IF(Parameter!$F$29=1,J19,IF(T19=\"\",0,J19)))","v":0},null,null,null,null,null,null,null,null,{"$f":"IF(I19>J19,I19-J19,0)","v":0},{"$f":"IF(C19<=TODAY(),IF(I19<J19,J19-I19,0),0)","v":0},null,null,null,null,null,null,null,null,null,null,null,null,null,{"$f":"IF(AF19<>\"\",IF(E19<>\"\",ABS(24*60*(E19-AF19)),ABS(24*60*(G19-AF19))),0)","v":0},{"$f":"COUNTA(AF19,AI19,AK19,AM19)","v":0},null,{"$f":"IF(AI19<>\"\",IF(H19<>\"\",ABS(24*60*(H19-AI19)),ABS(24*60*(F19-AI19))),0)","v":0},null,{"$f":"IF(AK19<>\"\",IF(E19<>\"\",ABS(24*60*(E19-AK19)),ABS(24*60*(G19-AK19))),0)","v":0},null,{"$f":"IF(AM19<>\"\",IF(H19<>\"\",ABS(24*60*(H19-AM19)),ABS(24*60*(F19-AM19))),0)","v":0},null,null,{"$f":"AQ18+R19-S19","v":0}]
[null,null,"2020-03-07","2020-03-07",null,null,null,null,{"$f":"IF(LEN(F20)+LEN(H20)>0,IF(LEN(H20)>0,(HOUR(F20-E20)+MINUTE(F20-E20)/60)+(HOUR(H20-G20)+MINUTE(H20-G20)/60),(HOUR(F20-E20)+MINUTE(F20-E20)/60)),IF(Parameter!$F$29=1,J20,IF(T20=\"\",0,J20)))","v":0},null,null,null,null,null,null,null,null,{"$f":"IF(I20>J20,I20-J20,0)","v":0},{"$f":"IF(C20<=TODAY(),IF(I20<J20,J20-I20,0),0)","v":0},null,null,null,null,null,null,null,null,null,null,null,null,null,{"$f":"IF(AF20<>\"\",IF(E20<>\"\",ABS(24*60*(E20-AF20)),ABS(24*60*(G20-AF20))),0)","v":0},{"$f":"COUNTA(AF20,AI20,AK20,AM20)","v":0},null,{"$f":"IF(AI20<>\"\",IF(H20<>\"\",ABS(24*60*(H20-AI20)),ABS(24*60*(F20-AI20))),0)","v":0},null,{"$f":"IF(AK20<>\"\",IF(E20<>\"\",ABS(24*60*(E20-AK20)),ABS(24*60*(G20-AK20))),0)","v":0},null,{"$f":"IF(AM20<>\"\",IF(H20<>\"\",ABS(24*60*(H20-AM20)),ABS(24*60*(F20-AM20))),0)","v":0},null,null,{"$f":"AQ19+R20-S20","v":0}]
[null,null,"2020-03-08","2020-03-08",null,null,null,null,{"$f":"IF(LEN(F21)+LEN(H21)>0,IF(LEN(H21)>0,(HOUR(F21-E21)+MINUTE(F21-E21)/60)+(HOUR(H21-G21)+MINUTE(H21-G21)/60),(HOUR(F21-E21)+MINUTE(F21-E21)/60)),IF(Parameter!$F$29=1,J21,IF(T21=\"\",0,J21)))","v":0},null,null,null,null,null,null,null,null,{"$f":"IF(I21>J21,I21-J21,0)","v":0},{"$f":"IF(C21<=TODAY(),IF(I21<J21,J21-I21,0),0)","v":0},null,null,null,null,null,null,null,null,null,null,null,null,null,{"$f":"IF(AF21<>\"\",IF(E21<>\"\",ABS(24*60*(E21-AF21)),ABS(24*60*(G21-AF21))),0)","v":0},{"$f":"COUNTA(AF21,AI21,AK21,AM21)","v":0},null,{"$f":"IF(AI21<>\"\",IF(H21<>\"\",ABS(24*60*(H21-AI21)),ABS(24*60*(F21-AI21))),0)","v":0},null,{"$f":"IF(AK21<>\"\",IF(E21<>\"\",ABS(24*60*(E21-AK21)),ABS(24*60*(G21-AK21))),0)","v":0},null,{"$f":"IF(AM21<>\"\",IF(H21<>\"\",ABS(24*60*(H21-AM21)),ABS(24*60*(F21-AM21))),0)","v":0},null,null,{"$f":"AQ20+R21-S21","v":0}]
[null,null,"2020-03-09","2020-03-09",null,null,null,null,{"$f":"IF(LEN(F22)+LEN(H22)>0,IF(LEN(H22)>0,(HOUR(F22-E22)+MINUTE(F22-E22)/60)+(HOUR(H22-G22)+MINUTE(H22-G22)/60),(HOUR(F22-E22)+MINUTE(F22-E22)/60)),IF(Parameter!$F$29=1,J22,IF(T22=\"\",0,J22)))","v":0},null,null,null,null,null,null,null,null,{"$f":"IF(I22>J22,I22-J22,0)","v":0},{"$f":"IF(C22<=TODAY(),IF(I22<J22,J22-I22,0),0)","v":0},null,null,null,null,null,null,null,null,null,null,null,null,null,{"$f":"IF(AF22<>\"\",IF(E22<>\"\",ABS(24*60*(E22-AF22)),ABS(24*60*(G22-AF22))),0)","v":0},{"$f":"COUNTA(AF22,AI22,AK22,AM22)","v":0},null,{"$f":"IF(AI22<>\"\",IF(H22<>\"\",ABS(24*60*(H22-AI22)),ABS(24*60*(F22-AI22))),0)","v":0},null,{"$f":"IF(AK22<>\"\",IF(E22<>\"\",ABS(24*60*(E22-AK22)),ABS(24*60*(G22-AK22))),0)","v":0},null,{"$f":"IF(AM22<>\"\",IF(H22<>\"\",ABS(24*60*(H22-AM22)),ABS(24*60*(F22-AM22))),0)","v":0},null,null,{"$f":"AQ21+R22-S22","v":0}]
[null,null,"2020-03-10","2020-03-10",null,null,null,null,{"$f":"IF(LEN(F23)+LEN(H23)>0,IF(LEN(H23)>0,(HOUR(F23-E23)+MINUTE(F23-E23)/60)+(HOUR(H23-G23)+MINUTE(H23-G23)/60),(HOUR(F23-E23)+MINUTE(F23-E23)/60)),IF(Parameter!$F$29=1,J23,IF(T23=\"\",0,J23)))","v":0},null,null,null,null,null,null,null,null,{"$f":"IF(I23>J23,I23-J23,0)","v":0},{"$f":"IF(C23<=TODAY(),IF(I23<J23,J23-I23,0),0)","v":0},null,null,null,null,null,null,null,null,null,null,null,null,null,{"$f":"IF(AF23<>\"\",IF(E23<>\"\",ABS(24*60*(E23-AF23)),ABS(24*60*(G23-AF23))),0)","v":0},{"$f":"COUNTA(AF23,AI23,AK23,AM23)","v":0},null,{"$f":"IF(AI23<>\"\",IF(H23<>\"\",ABS(24*60*(H23-AI23)),ABS(24*60*(F23-AI23))),0)","v":0},null,{"$f":"IF(AK23<>\"\",IF(E23<>\"\",ABS(24*60*(E23-AK23)),ABS(24*60*(G23-AK23))),0)","v":0},null,{"$f":"IF(AM23<>\"\",IF(H23<>\"\",ABS(24*60*(H23-AM23)),ABS(24*60*(F23-AM23))),0)","v":0},null,null,{"$f":"AQ22+R23-S23","v":0}]
[null,null,"2020-03-11","2020-03-11",null,null,null,null,{"$f":"IF(LEN(F24)+LEN(H24)>0,IF(LEN(H24)>0,(HOUR(F24-E24)+MINUTE(F24-E24)/60)+(HOUR(H24-G24)+MINUTE(H24-G24)/60),(HOUR(F24-E24)+MINUTE(F24-E24)/60)),IF(Parameter!$F$29=1,J24,IF(T24=\"\",0,J24)))","v":0},null,null,null,null,null,null,null,null,{"$f":"IF(I24>J24,I24-J24,0)","v":0},{"$f":"IF(C24<=TODAY(),IF(I24<J24,J24-I24,0),0)","v":0},null,null,null,null,null,null,null,null,null,null,null,null,null,{"$f":"IF(AF24<>\"\",IF(E24<>\"\",ABS(24*60*(E24-AF24)),ABS(24*60*(G24-AF24))),0)","v":0},{"$f":"COUNTA(AF24,AI24,AK24,AM24)","v":0},null,{"$f":"IF(AI24<>\"\",IF(H24<>\"\",ABS(24*60*(H24-AI24)),ABS(24*60*(F24-AI24))),0)","v":0},null,{"$f":"IF(AK24<>\"\",IF(E24<>\"\",ABS(24*60*(E24-AK24)),ABS(24*60*(G24-AK24))),0)","v":0},null,{"$f":"IF(AM24<>\"\",IF(H24<>\"\",ABS(24*60*(H24-AM24)),ABS(24*60*(F24-AM24))),0)","v":0},null,null,{"$f":"AQ23+R24-S24","v":0}]
[null,null,"2020-03-12","2020-03-12",null,null,null,null,{"$f":"IF(LEN(F25)+LEN(H25)>0,IF(LEN(H25)>0,(HOUR(F25-E25)+MINUTE(F25-E25)/60)+(HOUR(H25-G25)+MINUTE(H25-G25)/60),(HOUR(F25-E25)+MINUTE(F25-E25)/60)),IF(Parameter!$F$29=1,J25,IF(T25=\"\",0,J25)))","v":0},null,null,null,null,null,null,null,null,{"$f":"IF(I25>J25,I25-J25,0)","v":0},{"$f":"IF(C25<=TODAY(),IF(I25<J25,J25-I25,0),0)","v":0},null,null,null,null,null,null,null,null,null,null,null,null,null,{"$f":"IF(AF25<>\"\",IF(E25<>\"\",ABS(24*60*(E25-AF25)),ABS(24*60*(G25-AF25))),0)","v":0},{"$f":"COUNTA(AF25,AI25,AK25,AM25)","v":0},null,{"$f":"IF(AI25<>\"\",IF(H25<>\"\",ABS(24*60*(H25-AI25)),ABS(24*60*(F25-AI25))),0)","v":0},null,{"$f":"IF(AK25<>\"\",IF(E25<>\"\",ABS(24*60*(E25-AK25)),ABS(24*60*(G25-AK25))),0)","v":0},null,{"$f":"IF(AM25<>\"\",IF(H25<>\"\",ABS(24*60*(H25-AM25)),ABS(24*60*(F25-AM25))),0)","v":0},null,null,{"$f":"AQ24+R25-S25","v":0}]
[null,null,"2020-03-13","2020-03-13",null,null,null,null,{"$f":"IF(LEN(F26)+LEN(H26)>0,IF(LEN(H26)>0,(HOUR(F26-E26)+MINUTE(F26-E26)/60)+(HOUR(H26-G26)+MINUTE(H26-G26)/60),(HOUR(F26-E26)+MINUTE(F26-E26)/60)),IF(Parameter!$F$29=1,J26,IF(T26=\"\",0,J26)))","v":0},null,null,null,null,null,null,null,null,{"$f":"IF(I26>J26,I26-J26,0)","v":0},{"$f":"IF(C26<=TODAY(),IF(I26<J26,J26-I26,0),0)","v":0},null,null,null,null,null,null,null,null,null,null,null,null,null,{"$f":"IF(AF26<>\"\",IF(E26<>\"\",ABS(24*60*(E26-AF26)),ABS(24*60*(G26-AF26))),0)","v":0},{"$f":"COUNTA(AF26,AI26,AK26,AM26)","v":0},null,{"$f":"IF(AI26<>\"\",IF(H26<>\"\",ABS(24*60*(H26-AI26)),ABS(24*60*(F26-AI26))),0)","v":0},null,{"$f":"IF(AK26<>\"\",IF(E26<>\"\",ABS(24*60*(E26-AK26)),ABS(24*60*(G26-AK26))),0)","v":0},null,{"$f":"IF(AM26<>\"\",IF(H26<>\"\",ABS(24*60*(H26-AM26)),ABS(24*60*(F26-AM26))),0)","v":0},null,null,{"$f":"AQ25+R26-S26","v":0}]
[null,null,"2020-03-14","2020-03-14",null,null,null,null,{"$f":"IF(LEN(F27)+LEN(H27)>0,IF(LEN(H27)>0,(HOUR(F27-E27)+MINUTE(F27-E27)/60)+(HOUR(H27-G27)+MINUTE(H27-G27)/60),(HOUR(F27-E27)+MINUTE(F27-E27)/60)),IF(Parameter!$F$29=1,J27,IF(T27=\"\",0,J27)))","v":0},null,null,null,null,null,null,null,null,{"$f":"IF(I27>J27,I27-J27,0)","v":0},{"$f":"IF(C27<=TODAY(),IF(I27<J27,J27-I27,0),0)","v":0},null,null,null,null,null,null,null,null,null,null,null,null,null,{"$f":"IF(AF27<>\"\",IF(E27<>\"\",ABS(24*60*(E27-AF27)),ABS(24*60*(G27-AF27))),0)","v":0},{"$f":"COUNTA(AF27,AI27,AK27,AM27)","v":0},null,{"$f":"IF(AI27<>\"\",IF(H27<>\"\",ABS(24*60*(H27-AI27)),ABS(24*60*(F27-AI27))),0)","v":0},null,{"$f":"IF(AK27<>\"\",IF(E27<>\"\",ABS(24*60*(E27-AK27)),ABS(24*60*(G27-AK27))),0)","v":0},null,{"$f":"IF(AM27<>\"\",IF(H27<>\"\",ABS(24*60*(H27-AM27)),ABS(24*60*(F27-AM27))),0)","v":0},null,null,{"$f":"AQ26+R27-S27","v":0}]
[null,null,"2020-03-15","2020-03-15",null,null,null,null,{"$f":"IF(LEN(F28)+LEN(H28)>0,IF(LEN(H28)>0,(HOUR(F28-E28)+MINUTE(F28-E28)/60)+(HOUR(H28-G28)+MINUTE(H28-G28)/60),(HOUR(F28-E28)+MINUTE(F28-E28)/60)),IF(Parameter!$F$29=1,J28,IF(T28=\"\",0,J28)))","v":0},null,null,null,null,null,null,null,null,{"$f":"IF(I28>J28,I28-J28,0)","v":0},{"$f":"IF(C28<=TODAY(),IF(I28<J28,J28-I28,0),0)","v":0},null,null,null,null,null,null,null,null,null,null,null,null,null,{"$f":"IF(AF28<>\"\",IF(E28<>\"\",ABS(24*60*(E28-AF28)),ABS(24*60*(G28-AF28))),0)","v":0},{"$f":"COUNTA(AF28,AI28,AK28,AM28)","v":0},null,{"$f":"IF(AI28<>\"\",IF(H28<>\"\",ABS(24*60*(H28-AI28)),ABS(24*60*(F28-AI28))),0)","v":0},null,{"$f":"IF(AK28<>\"\",IF(E28<>\"\",ABS(24*60*(E28-AK28)),ABS(24*60*(G28-AK28))),0)","v":0},null,{"$f":"IF(AM28<>\"\",IF(H28<>\"\",ABS(24*60*(H28-AM28)),ABS(24*60*(F28-AM28))),0)","v":0},null,null,{"$f":"AQ27+R28-S28","v":0}]
[null,null,"2020-03-16","2020-03-16",null,null,null,null,{"$f":"IF(LEN(F29)+LEN(H29)>0,IF(LEN(H29)>0,(HOUR(F29-E29)+MINUTE(F29-E29)/60)+(HOUR(H29-G29)+MINUTE(H29-G29)/60),(HOUR(F29-E29)+MINUTE(F29-E29)/60)),IF(Parameter!$F$29=1,J29,IF(T29=\"\",0,J29)))","v":0},null,null,null,null,null,null,null,null,{"$f":"IF(I29>J29,I29-J29,0)","v":0},{"$f":"IF(C29<=TODAY(),IF(I29<J29,J29-I29,0),0)","v":0},null,null,null,null,null,null,null,null,null,null,null,null,null,{"$f":"IF(AF29<>\"\",IF(E29<>\"\",ABS(24*60*(E29-AF29)),ABS(24*60*(G29-AF29))),0)","v":0},{"$f":"COUNTA(AF29,AI29,AK29,AM29)","v":0},null,{"$f":"IF(AI29<>\"\",IF(H29<>\"\",ABS(24*60*(H29-AI29)),ABS(24*60*(F29-AI29))),0)","v":0},null,{"$f":"IF(AK29<>\"\",IF(E29<>\"\",ABS(24*60*(E29-AK29)),ABS(24*60*(G29-AK29))),0)","v":0},null,{"$f":"IF(AM29<>\"\",IF(H29<>\"\",ABS(24*60*(H29-AM29)),ABS(24*60*(F29-AM29))),0)","v":0},null,null,{"$f":"AQ28+R29-S29","v":0}]
[null,null,"2020-03-17","2020-03-17",null,null,null,null,{"$f":"IF(LEN(F30)+LEN(H30)>0,IF(LEN(H30)>0,(HOUR(F30-E30)+MINUTE(F30-E30)/60)+(HOUR(H30-G30)+MINUTE(H30-G30)/60),(HOUR(F30-E30)+MINUTE(F30-E30)/60)),IF(Parameter!$F$29=1,J30,IF(T30=\"\",0,J30)))","v":0},null,null,null,null,null,null,null,null,{"$f":"IF(I30>J30,I30-J30,0)","v":0},{"$f":"IF(C30<=TODAY(),IF(I30<J30,J30-I30,0),0)","v":0},null,null,null,null,null,null,null,null,null,null,null,null,null,{"$f":"IF(AF30<>\"\",IF(E30<>\"\",ABS(24*60*(E30-AF30)),ABS(24*60*(G30-AF30))),0)","v":0},{"$f":"COUNTA(AF30,AI30,AK30,AM30)","v":0},null,{"$f":"IF(AI30<>\"\",IF(H30<>\"\",ABS(24*60*(H30-AI30)),ABS(24*60*(F30-AI30))),0)","v":0},null,{"$f":"IF(AK30<>\"\",IF(E30<>\"\",ABS(24*60*(E30-AK30)),ABS(24*60*(G30-AK30))),0)","v":0},null,{"$f":"IF(AM30<>\"\",IF(H30<>\"\",ABS(24*60*(H30-AM30)),ABS(24*60*(F30-AM30))),0)","v":0},null,null,{"$f":"AQ29+R30-S30","v":0}]
[null,null,"2020-03-18","2020-03-18",null,null,null,null,{"$f":"IF(LEN(F31)+LEN(H31)>0,IF(LEN(H31)>0,(HOUR(F31-E31)+MINUTE(F31-E31)/60)+(HOUR(H31-G31)+MINUTE(H31-G31)/60),(HOUR(F31-E31)+MINUTE(F31-E31)/60)),IF(Parameter!$F$29=1,J31,IF(T31=\"\",0,J31)))","v":0},null,null,null,null,null,null,null,null,{"$f":"IF(I31>J31,I31-J31,0)","v":0},{"$f":"IF(C31<=TODAY(),IF(I31<J31,J31-I31,0),0)","v":0},null,null,null,null,null,null,null,null,null,null,null,null,null,{"$f":"IF(AF31<>\"\",IF(E31<>\"\",ABS(24*60*(E31-AF31)),ABS(24*60*(G31-AF31))),0)","v":0},{"$f":"COUNTA(AF31,AI31,AK31,AM31)","v":0},null,{"$f":"IF(AI31<>\"\",IF(H31<>\"\",ABS(24*60*(H31-AI31)),ABS(24*60*(F31-AI31))),0)","v":0},null,{"$f":"IF(AK31<>\"\",IF(E31<>\"\",ABS(24*60*(E31-AK31)),ABS(24*60*(G31-AK31))),0)","v":0},null,{"$f":"IF(AM31<>\"\",IF(H31<>\"\",ABS(24*60*(H31-AM31)),ABS(24*60*(F31-AM31))),0)","v":0},null,null,{"$f":"AQ30+R31-S31","v":0}]
[null,null,"2020-03-19","2020-03-19",null,null,null,null,{"$f":"IF(LEN(F32)+LEN(H32)>0,IF(LEN(H32)>0,(HOUR(F32-E32)+MINUTE(F32-E32)/60)+(HOUR(H32-G32)+MINUTE(H32-G32)/60),(HOUR(F32-E32)+MINUTE(F32-E32)/60)),IF(Parameter!$F$29=1,J32,IF(T32=\"\",0,J32)))","v":0},null,null,null,null,null,null,null,null,{"$f":"IF(I32>J32,I32-J32,0)","v":0},{"$f":"IF(C32<=TODAY(),IF(I32<J32,J32-I32,0),0)","v":0},null,null,null,null,null,null,null,null,null,null,null,null,null,{"$f":"IF(AF32<>\"\",IF(E32<>\"\",ABS(24*60*(E32-AF32)),ABS(24*60*(G32-AF32))),0)","v":0},{"$f":"COUNTA(AF32,AI32,AK32,AM32)","v":0},null,{"$f":"IF(AI32<>\"\",IF(H32<>\"\",ABS(24*60*(H32-AI32)),ABS(24*60*(F32-AI32))),0)","v":0},null,{"$f":"IF(AK32<>\"\",IF(E32<>\"\",ABS(24*60*(E32-AK32)),ABS(24*60*(G32-AK32))),0)","v":0},null,{"$f":"IF(AM32<>\"\",IF(H32<>\"\",ABS(24*60*(H32-AM32)),ABS(24*60*(F32-AM32))),0)","v":0},null,null,{"$f":"AQ31+R32-S32","v":0}]
[null,null,"2020-03-20","2020-03-20",null,null,null,null,{"$f":"IF(LEN(F33)+LEN(H33)>0,IF(LEN(H33)>0,(HOUR(F33-E33)+MINUTE(F33-E33)/60)+(HOUR(H33-G33)+MINUTE(H33-G33)/60),(HOUR(F33-E33)+MINUTE(F33-E33)/60)),IF(Parameter!$F$29=1,J33,IF(T33=\"\",0,J33)))","v":0},null,null,null,null,null,null,null,null,{"$f":"IF(I33>J33,I33-J33,0)","v":0},{"$f":"IF(C33<=TODAY(),IF(I33<J33,J33-I33,0),0)","v":0},null,null,null,null,null,null,null,null,null,null,null,null,null,{"$f":"IF(AF33<>\"\",IF(E33<>\"\",ABS(24*60*(E33-AF33)),ABS(24*60*(G33-AF33))),0)","v":0},{"$f":"COUNTA(AF33,AI33,AK33,AM33)","v":0},null,{"$f":"IF(AI33<>\"\",IF(H33<>\"\",ABS(24*60*(H33-AI33)),ABS(24*60*(F33-AI33))),0)","v":0},null,{"$f":"IF(AK33<>\"\",IF(E33<>\"\",ABS(24*60*(E33-AK33)),ABS(24*60*(G33-AK33))),0)","v":0},null,{"$f":"IF(AM33<>\"\",IF(H33<>\"\",ABS(24*60*(H33-AM33)),ABS(24*60*(F33-AM33))),0)","v":0},null,null,{"$f":"AQ32+R33-S33","v":0}]
[null,null,"2020-03-21","2020-03-21",null,null,null,null,{"$f":"IF(LEN(F34)+LEN(H34)>0,IF(LEN(H34)>0,(HOUR(F34-E34)+MINUTE(F34-E34)/60)+(HOUR(H34-G34)+MINUTE(H34-G34)/60),(HOUR(F34-E34)+MINUTE(F34-E34)/60)),IF(Parameter!$F$29=1,J34,IF(T34=\"\",0,J34)))","v":0},null,null,null,null,null,null,null,null,{"$f":"IF(I34>J34,I34-J34,0)","v":0},{"$f":"IF(C34<=TODAY(),IF(I34<J34,J34-I34,0),0)","v":0},null,null,null,null,null,null,null,null,null,null,null,null,null,{"$f":"IF(AF34<>\"\",IF(E34<>\"\",ABS(24*60*(E34-AF34)),ABS(24*60*(G34-AF34))),0)","v":0},{"$f":"COUNTA(AF34,AI34,AK34,AM34)","v":0},null,{"$f":"IF(AI34<>\"\",IF(H34<>\"\",ABS(24*60*(H34-AI34)),ABS(24*60*(F34-AI34))),0)","v":0},null,{"$f":"IF(AK34<>\"\",IF(E34<>\"\",ABS(24*60*(E34-AK34)),ABS(24*60*(G34-AK34))),0)","v":0},null,{"$f":"IF(AM34<>\"\",IF(H34<>\"\",ABS(24*60*(H34-AM34)),ABS(24*60*(F34-AM34))),0)","v":0},null,null,{"$f":"AQ33+R34-S34","v":0}]
[null,null,"2020-03-22","2020-03-22",null,null,null,null,{"$f":"IF(LEN(F35)+LEN(H35)>0,IF(LEN(H35)>0,(HOUR(F35-E35)+MINUTE(F35-E35)/60)+(HOUR(H35-G35)+MINUTE(H35-G35)/60),(HOUR(F35-E35)+MINUTE(F35-E35)/60)),IF(Parameter!$F$29=1,J35,IF(T35=\"\",0,J35)))","v":0},null,null,null,null,null,null,null,null,{"$f":"IF(I35>J35,I35-J35,0)","v":0},{"$f":"IF(C35<=TODAY(),IF(I35<J35,J35-I35,0),0)","v":0},null,null,null,null,null,null,null,null,null,null,null,null,null,{"$f":"IF(AF35<>\"\",IF(E35<>\"\",ABS(24*60*(E35-AF35)),ABS(24*60*(G35-AF35))),0)","v":0},{"$f":"COUNTA(AF35,AI35,AK35,AM35)","v":0},null,{"$f":"IF(AI35<>\"\",IF(H35<>\"\",ABS(24*60*(H35-AI35)),ABS(24*60*(F35-AI35))),0)","v":0},null,{"$f":"IF(AK35<>\"\",IF(E35<>\"\",ABS(24*60*(E35-AK35)),ABS(24*60*(G35-AK35))),0)","v":0},null,{"$f":"IF(AM35<>\"\",IF(H35<>\"\",ABS(24*60*(H35-AM35)),ABS(24*60*(F35-AM35))),0)","v":0},null,null,{"$f":"AQ34+R35-S35","v":0}]
[null,null,"2020-03-23","2020-03-23",null,null,null,null,{"$f":"IF(LEN(F36)+LEN(H36)>0,IF(LEN(H36)>0,(HOUR(F36-E36)+MINUTE(F36-E36)/60)+(HOUR(H36-G36)+MINUTE(H36-G36)/60),(HOUR(F36-E36)+MINUTE(F36-E36)/60)),IF(Parameter!$F$29=1,J36,IF(T36=\"\",0,J36)))","v":0},null,null,null,null,null,null,null,null,{"$f":"IF(I36>J36,I36-J36,0)","v":0},{"$f":"IF(C36<=TODAY(),IF(I36<J36,J36-I36,0),0)","v":0},null,null,null,null,null,null,null,null,null,null,null,null,null,{"$f":"IF(AF36<>\"\",IF(E36<>\"\",ABS(24*60*(E36-AF36)),ABS(24*60*(G36-AF36))),0)","v":0},{"$f":"COUNTA(AF36,AI36,AK36,AM36)","v":0},null,{"$f":"IF(AI36<>\"\",IF(H36<>\"\",ABS(24*60*(H36-AI36)),ABS(24*60*(F36-AI36))),0)","v":0},null,{"$f":"IF(AK36<>\"\",IF(E36<>\"\",ABS(24*60*(E36-AK36)),ABS(24*60*(G36-AK36))),0)","v":0},null,{"$f":"IF(AM36<>\"\",IF(H36<>\"\",ABS(24*60*(H36-AM36)),ABS(24*60*(F36-AM36))),0)","v":0},null,null,{"$f":"AQ35+R36-S36","v":0}]
[null,null,"2020-03-24","2020-03-24",null,null,null,null,{"$f":"IF(LEN(F37)+LEN(H37)>0,IF(LEN(H37)>0,(HOUR(F37-E37)+MINUTE(F37-E37)/60)+(HOUR(H37-G37)+MINUTE(H37-G37)/60),(HOUR(F37-E37)+MINUTE(F37-E37)/60)),IF(Parameter!$F$29=1,J37,IF(T37=\"\",0,J37)))","v":0},null,null,null,null,null,null,null,null,{"$f":"IF(I37>J37,I37-J37,0)","v":0},{"$f":"IF(C37<=TODAY(),IF(I37<J37,J37-I37,0),0)","v":0},null,null,null,null,null,null,null,null,null,null,null,null,null,{"$f":"IF(AF37<>\"\",IF(E37<>\"\",ABS(24*60*(E37-AF37)),ABS(24*60*(G37-AF37))),0)","v":0},{"$f":"COUNTA(AF37,AI37,AK37,AM37)","v":0},null,{"$f":"IF(AI37<>\"\",IF(H37<>\"\",ABS(24*60*(H37-AI37)),ABS(24*60*(F37-AI37))),0)","v":0},null,{"$f":"IF(AK37<>\"\",IF(E37<>\"\",ABS(24*60*(E37-AK37)),ABS(24*60*(G37-AK37))),0)","v":0},null,{"$f":"IF(AM37<>\"\",IF(H37<>\"\",ABS(24*60*(H37-AM37)),ABS(24*60*(F37-AM37))),0)","v":0},null,null,{"$f":"AQ36+R37-S37","v":0}]
[null,null,"2020-03-25","2020-03-25",null,null,null,null,{"$f":"IF(LEN(F38)+LEN(H38)>0,IF(LEN(H38)>0,(HOUR(F38-E38)+MINUTE(F38-E38)/60)+(HOUR(H38-G38)+MINUTE(H38-G38)/60),(HOUR(F38-E38)+MINUTE(F38-E38)/60)),IF(Parameter!$F$29=1,J38,IF(T38=\"\",0,J38)))","v":0},null,null,null,null,null,null,null,null,{"$f":"IF(I38>J38,I38-J38,0)","v":0},{"$f":"IF(C38<=TODAY(),IF(I38<J38,J38-I38,0),0)","v":0},null,null,null,null,null,null,null,null,null,null,null,null,null,{"$f":"IF(AF38<>\"\",IF(E38<>\"\",ABS(24*60*(E38-AF38)),ABS(24*60*(G38-AF38))),0)","v":0},{"$f":"COUNTA(AF38,AI38,AK38,AM38)","v":0},null,{"$f":"IF(AI38<>\"\",IF(H38<>\"\",ABS(24*60*(H38-AI38)),ABS(24*60*(F38-AI38))),0)","v":0},null,{"$f":"IF(AK38<>\"\",IF(E38<>\"\",ABS(24*60*(E38-AK38)),ABS(24*60*(G38-AK38))),0)","v":0},null,{"$f":"IF(AM38<>\"\",IF(H38<>\"\",ABS(24*60*(H38-AM38)),ABS(24*60*(F38-AM38))),0)","v":0},null,null,{"$f":"AQ37+R38-S38","v":0}]
[null,null,"2020-03-26","2020-03-26",null,null,null,null,{"$f":"IF(LEN(F39)+LEN(H39)>0,IF(LEN(H39)>0,(HOUR(F39-E39)+MINUTE(F39-E39)/60)+(HOUR(H39-G39)+MINUTE(H39-G39)/60),(HOUR(F39-E39)+MINUTE(F39-E39)/60)),IF(Parameter!$F$29=1,J39,IF(T39=\"\",0,J39)))","v":0},null,null,null,null,null,null,null,null,{"$f":"IF(I39>J39,I39-J39,0)","v":0},{"$f":"IF(C39<=TODAY(),IF(I39<J39,J39-I39,0),0)","v":0},null,null,null,null,null,null,null,null,null,null,null,null,null,{"$f":"IF(AF39<>\"\",IF(E39<>\"\",ABS(24*60*(E39-AF39)),ABS(24*60*(G39-AF39))),0)","v":0},{"$f":"COUNTA(AF39,AI39,AK39,AM39)","v":0},null,{"$f":"IF(AI39<>\"\",IF(H39<>\"\",ABS(24*60*(H39-AI39)),ABS(24*60*(F39-AI39))),0)","v":0},null,{"$f":"IF(AK39<>\"\",IF(E39<>\"\",ABS(24*60*(E39-AK39)),ABS(24*60*(G39-AK39))),0)","v":0},null,{"$f":"IF(AM39<>\"\",IF(H39<>\"\",ABS(24*60*(H39-AM39)),ABS(24*60*(F39-AM39))),0)","v":0},null,null,{"$f":"AQ38+R39-S39","v":0}]
[null,null,"2020-03-27","2020-03-27",null,null,null,null,{"$f":"IF(LEN(F40)+LEN(H40)>0,IF(LEN(H40)>0,(HOUR(F40-E40)+MINUTE(F40-E40)/60)+(HOUR(H40-G40)+MINUTE(H40-G40)/60),(HOUR(F40-E40)+MINUTE(F40-E40)/60)),IF(Parameter!$F$29=1,J40,IF(T40=\"\",0,J40)))","v":0},null,null,null,null,null,null,null,null,{"$f":"IF(I40>J40,I40-J40,0)","v":0},{"$f":"IF(C40<=TODAY(),IF(I40<J40,J40-I40,0),0)","v":0},null,null,null,null,null,null,null,null,null,null,null,null,null,{"$f":"IF(AF40<>\"\",IF(E40<>\"\",ABS(24*60*(E40-AF40)),ABS(24*60*(G40-AF40))),0)","v":0},{"$f":"COUNTA(AF40,AI40,AK40,AM40)","v":0},null,{"$f":"IF(AI40<>\"\",IF(H40<>\"\",ABS(24*60*(H40-AI40)),ABS(24*60*(F40-AI40))),0)","v":0},null,{"$f":"IF(AK40<>\"\",IF(E40<>\"\",ABS(24*60*(E40-AK40)),ABS(24*60*(G40-AK40))),0)","v":0},null,{"$f":"IF(AM40<>\"\",IF(H40<>\"\",ABS(24*60*(H40-AM40)),ABS(24*60*(F40-AM40))),0)","v":0},null,null,{"$f":"AQ39+R40-S40","v":0}]
[null,null,"2020-03-28","2020-03-28",null,null,null,null,{"$f":"IF(LEN(F41)+LEN(H41)>0,IF(LEN(H41)>0,(HOUR(F41-E41)+MINUTE(F41-E41)/60)+(HOUR(H41-G41)+MINUTE(H41-G41)/60),(HOUR(F41-E41)+MINUTE(F41-E41)/60)),IF(Parameter!$F$29=1,J41,IF(T41=\"\",0,J41)))","v":0},null,null,null,null,null,null,null,null,{"$f":"IF(I41>J41,I41-J41,0)","v":0},{"$f":"IF(C41<=TODAY(),IF(I41<J41,J41-I41,0),0)","v":0},null,null,null,null,null,null,null,null,null,null,null,null,null,{"$f":"IF(AF41<>\"\",IF(E41<>\"\",ABS(24*60*(E41-AF41)),ABS(24*60*(G41-AF41))),0)","v":0},{"$f":"COUNTA(AF41,AI41,AK41,AM41)","v":0},null,{"$f":"IF(AI41<>\"\",IF(H41<>\"\",ABS(24*60*(H41-AI41)),ABS(24*60*(F41-AI41))),0)","v":0},null,{"$f":"IF(AK41<>\"\",IF(E41<>\"\",ABS(24*60*(E41-AK41)),ABS(24*60*(G41-AK41))),0)","v":0},null,{"$f":"IF(AM41<>\"\",IF(H41<>\"\",ABS(24*60*(H41-AM41)),ABS(24*60*(F41-AM41))),0)","v":0},null,null,{"$f":"AQ40+R41-S41","v":0}]
[null,null,"2020-03-29","2020-03-29",null,null,null,null,{"$f":"IF(LEN(F42)+LEN(H42)>0,IF(LEN(H42)>0,(HOUR(F42-E42)+MINUTE(F42-E42)/60)+(HOUR(H42-G42)+MINUTE(H42-G42)/60),(HOUR(F42-E42)+MINUTE(F42-E42)/60)),IF(Parameter!$F$29=1,J42,IF(T42=\"\",0,J42)))","v":0},null,null,null,null,null,null,null,null,{"$f":"IF(I42>J42,I42-J42,0)","v":0},{"$f":"IF(C42<=TODAY(),IF(I42<J42,J42-I42,0),0)","v":0},null,null,null,null,null,null,null,null,null,null,null,null,null,{"$f":"IF(AF42<>\"\",IF(E42<>\"\",ABS(24*60*(E42-AF42)),ABS(24*60*(G42-AF42))),0)","v":0},{"$f":"COUNTA(AF42,AI42,AK42,AM42)","v":0},null,{"$f":"IF(AI42<>\"\",IF(H42<>\"\",ABS(24*60*(H42-AI42)),ABS(24*60*(F42-AI42))),0)","v":0},null,{"$f":"IF(AK42<>\"\",IF(E42<>\"\",ABS(24*60*(E42-AK42)),ABS(24*60*(G42-AK42))),0)","v":0},null,{"$f":"IF(AM42<>\"\",IF(H42<>\"\",ABS(24*60*(H42-AM42)),ABS(24*60*(F42-AM42))),0)","v":0},null,null,{"$f":"AQ41+R42-S42","v":0}]
[null,null,{"$f":"IF(MONTH(C14)<>2,IF(MONTH(C42+1)>MONTH(C42),\"\",C42+1),\"\")","v":"2020-03-30"},"2020-03-30",null,null,null,null,{"$f":"IF(LEN(F43)+LEN(H43)>0,IF(LEN(H43)>0,(HOUR(F43-E43)+MINUTE(F43-E43)/60)+(HOUR(H43-G43)+MINUTE(H43-G43)/60),(HOUR(F43-E43)+MINUTE(F43-E43)/60)),IF(Parameter!$F$29=1,J43,IF(T43=\"\",0,J43)))","v":0},null,null,null,null,null,null,null,null,{"$f":"IF(I43>J43,I43-J43,0)","v":0},{"$f":"IF(C43<=TODAY(),IF(I43<J43,J43-I43,0),0)","v":0},null,null,null,null,null,null,null,null,null,null,null,null,null,{"$f":"IF(AF43<>\"\",IF(E43<>\"\",ABS(24*60*(E43-AF43)),ABS(24*60*(G43-AF43))),0)","v":0},{"$f":"COUNTA(AF43,AI43,AK43,AM43)","v":0},null,{"$f":"IF(AI43<>\"\",IF(H43<>\"\",ABS(24*60*(H43-AI43)),ABS(24*60*(F43-AI43))),0)","v":0},null,{"$f":"IF(AK43<>\"\",IF(E43<>\"\",ABS(24*60*(E43-AK43)),ABS(24*60*(G43-AK43))),0)","v":0},null,{"$f":"IF(AM43<>\"\",IF(H43<>\"\",ABS(24*60*(H43-AM43)),ABS(24*60*(F43-AM43))),0)","v":0},null,null,{"$f":"AQ42+R43-S43","v":0}]
[null,null,{"$f":"IF(MONTH(C14)<>2,IF(MONTH(C43+1)>MONTH(C43),\"\",C43+1),\"\")","v":"2020-03-31"},"2020-03-31",null,null,null,null,{"$f":"IF(LEN(F44)+LEN(H44)>0,IF(LEN(H44)>0,(HOUR(F44-E44)+MINUTE(F44-E44)/60)+(HOUR(H44-G44)+MINUTE(H44-G44)/60),(HOUR(F44-E44)+MINUTE(F44-E44)/60)),IF(Parameter!$F$29=1,J44,IF(T44=\"\",0,J44)))","v":0},null,null,null,null,null,null,null,null,{"$f":"IF(I44>J44,I44-J44,0)","v":0},{"$f":"IF(C44<=TODAY(),IF(I44<J44,J44-I44,0),0)","v":0},null,null,null,null,null,null,null,null,null,null,null,null,null,{"$f":"IF(AF44<>\"\",IF(E44<>\"\",ABS(24*60*(E44-AF44)),ABS(24*60*(G44-AF44))),0)","v":0},{"$f":"COUNTA(AF44,AI44,AK44,AM44)","v":0},null,{"$f":"IF(AI44<>\"\",IF(H44<>\"\",ABS(24*60*(H44-AI44)),ABS(24*60*(F44-AI44))),0)","v":0},null,{"$f":"IF(AK44<>\"\",IF(E44<>\"\",ABS(24*60*(E44-AK44)),ABS(24*60*(G44-AK44))),0)","v":0},null,{"$f":"IF(AM44<>\"\",IF(H44<>\"\",ABS(24*60*(H44-AM44)),ABS(24*60*(F44-AM44))),0)","v":0},null,null,{"$f":"AQ43+R44-S44","v":0}]
[null,null,null,null,null,null,null,"Summe:",{"$f":"ROUND(SUM(I14:I44),2)","v":0},{"$f":"ROUND(SUM(J13:J44),2)","v":0},{"$f":"SUM(K14:K44)","v":0},0,0,0,0,0,0,{"$f":"ROUND(SUM(R14:R44),2)","v":0},{"$f":"ROUND(SUM(S14:S44),2)","v":0},{"$f":"IF(COUNTA(T14:T44)=0,\"\",\"/U:\" & COUNTIF(T14:T44,\"u\")&\"/K:\" & COUNTIF(T14:T44,\"k\")&\"/Rest:\" & COUNTA(T14:T44)-COUNTIF(T14:T44,\"u\")-COUNTIF(T14:T44,\"k\"))","v":""},null,null,"Kontrollsummen:",null,null,null,null,null,null,null,null,null,null,null,null,null,null,null,null,null,null,null,null,{"$f":"SUM(AR14:AR44)","v":0},0,0,0,null,0,0,null,"Durchschnitt"]
[null,null,null,null,null,null,null,null,null,null,null,null,null,null,null,null,null,{"$f":"ROUND(R45-S45,2)","v":0},null,"Monatssaldo",null,null,{"$f":"\"IST-Stunden \"&ISTsumme&\" - SOLL-Stunden \"&SOLLsumme&\" =\"","v":"IST-Stunden 0 - SOLL-Stunden 0 ="},null,null,{"$f":"ISTsumme-SOLLsumme","v":0},null,null,null,null,null,null,null,null,null,null,null,null,null,null,null,null,null,null,null,null,null,null,null,null,null,{"$f":"IFERROR(SUM(AZ14:AZ44)/COUNTA(AZ14:AZ44),\"\")","v":""}]
[null,null,"Über-/Mehrstunden",null,null,{"$f":"ROUND(AT45+AU45,2)","v":0},"korr.Endsaldo inkl.Vorperiode:",null,null,null,null,null,null,null,null,null,null,{"$f":"ROUND(R9+R46,2)+F48","v":0},null,"Endsaldo inkl.Vorperiode",null,null,{"$f":"IF(M45<>0,\"minus automatische Überstunden:\",\"Monatssaldo (Zelle R46):\")","v":"Monatssaldo (Zelle R46):"},null,null,{"$f":"IF(M45<>0,-M45,R46)","v":0}]
[null,null,"Zeitsaldo Korrektur",null,null,{"$f":"ROUND((AS45-AT45),2)","v":0},null,null,null,null,null,null,null,null,null,null,null,null,null,"Auszahlung Gutstunden",null,null,{"$f":"IF(M45<>0,\"=Monatssaldo (Zelle R46):\",\"Differenz =\")","v":"Differenz ="},null,null,{"$f":"IF(M45<>0,(Z46+Z47),ROUND(Z46-Z47,1))","v":0}]
[null,null,"Info Lohn: ",null,null,null,null,null,null,null,null,null,null,null,null,null,null,{"$f":"R47-R48","v":0},null,"Vortrag abzgl.Auszahlg.",null,null,{"$f":"IF(M45<>0,\"Differenz =\",\"\")","v":""},null,null,{"$f":"IF(M45<>0,ROUND(Z48-R46,1),\"\")","v":""}]

{"sheet":"4 APR","index":6,"n_rows":49,"n_cols":75,"rows_kept":49,"cut":false,"hidden":false,"merged":[[2,34,2,35],[5,27,6,27],[8,26,9,26],[2,30,2,32],[47,22,47,24],[11,25,11,26],[11,34,11,35],[11,23,11,24],[10,20,12,20],[10,22,10,26],[44,19,44,20],[10,10,12,10],[10,11,12,11],[10,12,12,12],[48,19,48,21],[47,10,47,13],[45,8,45,9],[45,22,45,24],[46,22,46,24],[45,19,45,21],[46,6,46,16],[7,12,8,12],[0,22,0,26],[48,22,48,24],[10,14,12,14],[10,15,12,15],[10,16,12,16],[48,17,48,18],[11,17,11,18],[46,17,46,18],[10,19,12,19],[47,14,47,16],[47,17,47,18],[11,22,12,22],[45,17,45,18],[46,19,46,21],[47,19,47,21],[7,2,7,3],[7,4,7,8],[8,4,8,8],[7,10,8,10],[7,11,8,11],[10,3,11,3],[11,6,11,7],[10,8,11,9],[8,2,8,3],[11,4,11,5],[10,4,10,7],[10,2,11,2],[48,2,48,3],[48,4,48,9],[46,2,46,4],[47,2,47,4],[47,6,47,9],[2,69,11,69],[2,70,11,70],[5,16,6,16],[2,2,2,18],[6,26,7,26],[5,22,5,24],[5,5,5,8],[5,2,5,4],[5,10,5,13],[7,16,8,16],[8,17,8,18],[7,14,8,14],[7,15,8,15],[5,17,7,18],[7,13,8,13],[10,13,12,13],[2,71,11,71],[2,72,11,72],[2,73,11,73],[2,74,11,74],[2,37,2,38],[10,51,12,51],[10,47,12,47],[10,48,12,48],[10,49,12,49],[10,50,12,50],[10,46,12,46],[10,42,12,42],[10,43,12,43],[10,44,12,44],[10,45,12,45],[11,37,11,38]]}
[]
[]
[null,null,null,null,null,null,null,null,null,null,null,null,null,null,null,null,null,null,null,null,null,null,null,null,null,null,null,null,null,null,null,null,null,null,null,null,null,null,null,null,null,null,null,null,null,null,null,null,null,null,null,null,null,null,null,null,null,null,null,null,null,null,null,null,null,null,null,null,null,{"$f":"IF(AND(Parameter!B69<>\"\"),Parameter!B69&\" \"&Parameter!E69&\"%\",\"\")","v":"Zuschlag vor DP-Beginn 25%"},{"$f":"IF(AND(Parameter!E70<>\"\",Parameter!F70<>\"\"),Parameter!B70&\" \"&TEXT(Parameter!F70,\"hh:mm\")&\" \"&Parameter!E70&\"%\",\"\")","v":"Zuschlag innerhalb DP \nnach 1.Uhrzeit 19:30 50%"},{"$f":"Parameter!B71&\" \"&TEXT(Parameter!F71,\"hh:mm\")&\" \"&Parameter!E71&\"%\"","v":"Zuschlag innerhalb DP \nnach 2.Uhrzeit 21:00 75%"},{"$f":"Parameter!B72&\" \"&TEXT(Parameter!F72,\"hh:mm\")&\" \"&Parameter!E72&\"%\"","v":"Zuschlag außerhalb DP \nnach 1.Uhrzeit 19:30 100%"},{"$f":"Parameter!B73&\" \"&TEXT(Parameter!F73,\"hh:mm\")&\" \"&Parameter!E73&\"%\"","v":"Zuschlag außerhalb DP \nnach 2.Uhrzeit 21:00 125%"},{"$f":"IF(AND(Parameter!B74<>\"\"),Parameter!B74&\" \"&Parameter!E74&\"%\",\"\")","v":"Zuschlag nach DP-Ende 150%"}]
[]
[]
[null,null,"Monat",null,null,{"$f":"MonatsErster+91","v":"2020-04-01"},null,null,null,null,"täglich",null,null,null,"So/Feier","Woche",{"$f":"IF(LEFT(Parameter!J62,1)=\"1\",\"Manuell\",\"Morgen Zeit\")","v":"Manuell"},"Vortrag\nVormonat"]
[]
[null,null,"MitarbeitNr.",null,{"$f":"IF('1 JAN'!E8<>\"\",'1 JAN'!E8,\"\")","v":""},null,null,null,null,null,{"$f":"Parameter!Q50","v":">21:00   100% Üh   "},{"$f":"Parameter!Q52","v":">19:30   50% Üh   "},{"$f":"Parameter!Q54","v":">9h                 50% Üh   "},{"$f":"Parameter!Q56","v":"> Soll-h bis 9 Std.                    50% Üh   "},{"$f":"Parameter!Q58","v":"So/Feiert 100% Üh   "},{"$f":"Parameter!Q60","v":">39h      100% Üh   "},{"$f":"Parameter!Q62","v":"manuell    50% Mh   "}]
[null,null,"Name:",null,{"$f":"IF('1 JAN'!E9<>\"\",'1 JAN'!E9,\"\")","v":""},null,null,null,null,null,null,null,null,null,null,null,null,{"$f":"IF(Parameter!F34=TRUE,'3 MAR'!R49:S49,0)","v":0}]
[null,null,null,{"$f":"IF(D16=\"Fr\",\"JA\",\"\")","v":""}]
[null,null,"Datum","Tag","tatsächliche Arbeitszeit",null,null,null," Gesamt\nStunden",null,{"$f":"MID(Parameter!F50,3,99)","v":"Grund-Stunde ZA - Zuschlag auszahlen"},{"$f":"MID(Parameter!F52,3,99)","v":"Grund-Stunde ZA - Zuschlag auszahlen"},{"$f":"MID(Parameter!F54,3,99)","v":"Grund-Stunde ZA - Zuschlag auszahlen"},{"$f":"MID(Parameter!F56,3,99)","v":"Grund-Stunde ZA - Zuschlag auszahlen"},{"$f":"MID(Parameter!F58,3,99)","v":"Grund-Stunde ZA - Zuschlag auszahlen"},{"$f":"MID(Parameter!F60,3,99)","v":"Grund-Stunde ZA - Zuschlag auszahlen"},{"$f":"MID(Parameter!F62,3,99)","v":"Grund-Stunde ZA - Zuschlag auszahlen"},"Gut-","Minus-"," Urlaub\nKrank\n\nU oder K \nmachen","Feiertag\n\nF-ix\nB-ewegl.",null,{"$f":"IF(AND(UPPER(Parameter!G68=\"AKTIV\"),UPPER(Parameter!R69=\"AKTIV\")),\"Dienstplan-Vorschlag übernehmen\",IF(UPPER(Parameter!G68=\"AKTIV\"),\"Dienstplan\",\"Manuelle Zeiterfassung\"))","v":"Manuelle Zeiterfassung"},null,null,null,null,null,null,null,null,null,null,null,null,null,null,null,null,null,null,null,"Aktueller\nTages\nSaldo","Summe Grundstunden\nim Zeitsaldo","Summe \nZuschlag \nZeitsaldo \nerhöhend","Summe Grundstunden\nzur Auszahlung","Summe \nZuschlag\nzur Auszahlung","Korrigierter Tagessaldo","Korrigierte \nTages IST-Std","Differenz SOLL-Std zu IST-Std inkl. Zeitsaldo Korrekturen","Tagesstunden + sonntags Summe Wochen-\nStunden","Wochen\nsumme \n(korrigiert)"]
[null,null,null,null,"Vormittag",null,"Nachmittag",null,null,null,null,null,null,null,null,null,null,"Stunden",null,null,null,null,{"$f":"IF(UPPER(Parameter!G68)=\"AKTIV\",\"Manuelle Zeiten in Spalte W sind monatlich manuell in die Spalten E-H zu übernehmen\",\"Begründung manuelle Zeiterfassung\")","v":"Begründung manuelle Zeiterfassung"},"Vormittag",null,"Nachmittag"]
[null,"OK",null,null,"von","bis","von","bis","Ist","Soll",null,null,null,null,null,null,null,"+","-",null,null,null,null,"von","bis","von","bis",null,null,null,"Anmerkung","Internet AN Vorm.","Differenz","Anzahl Internetzeiten","Internet AB Vorm","Differenz","Internet AN Nachm.","Differenz","Internet AB Nachm.","Differenz",null,null,null,null,null,null,null,null,null,null,null,null,null,null,null,null,null,null,null,null,null,null,null,null,null,null,null,null,null,{"$f":"SUM(BR14:BR44)","v":0},0,0,0,0,0]
[null,null,{"$f":"DATE('1 JAN'!G2,4,1)","v":"2020-04-01"},{"$f":"C14","v":"2020-04-01"},null,null,null,null,{"$f":"IF(LEN(F14)+LEN(H14)>0,IF(LEN(H14)>0,(HOUR(F14-E14)+MINUTE(F14-E14)/60)+(HOUR(H14-G14)+MINUTE(H14-G14)/60),(HOUR(F14-E14)+MINUTE(F14-E14)/60)),IF(Parameter!$F$29=1,J14,IF(T14=\"\",0,J14)))","v":0},null,null,null,null,null,null,null,null,{"$f":"IF(I14>J14,I14-J14,0)","v":0},{"$f":"IF(C14<=TODAY(),IF(I14<J14,J14-I14,0),0)","v":0},null,null,null,null,null,null,null,null,null,null,null,null,null,{"$f":"IF(AF14<>\"\",IF(E14<>\"\",ABS(24*60*(E14-AF14)),ABS(24*60*(G14-AF14))),0)","v":0},{"$f":"COUNTA(AF14,AI14,AK14,AM14)","v":0},null,{"$f":"IF(AI14<>\"\",IF(H14<>\"\",ABS(24*60*(H14-AI14)),ABS(24*60*(F14-AI14))),0)","v":0},null,{"$f":"IF(AK14<>\"\",IF(E14<>\"\",ABS(24*60*(E14-AK14)),ABS(24*60*(G14-AK14))),0)","v":0},null,{"$f":"IF(AM14<>\"\",IF(H14<>\"\",ABS(24*60*(H14-AM14)),ABS(24*60*(F14-AM14))),0)","v":0},null,null,{"$f":"R9+R14-S14","v":0}]
[null,null,{"$f":"IF(MONTH(C14+1)>MONTH(C14),\"\",C14+1)","v":"2020-04-02"},"2020-04-02",null,null,null,null,{"$f":"IF(LEN(F15)+LEN(H15)>0,IF(LEN(H15)>0,(HOUR(F15-E15)+MINUTE(F15-E15)/60)+(HOUR(H15-G15)+MINUTE(H15-G15)/60),(HOUR(F15-E15)+MINUTE(F15-E15)/60)),IF(Parameter!$F$29=1,J15,IF(T15=\"\",0,J15)))","v":0},null,null,null,null,null,null,null,null,{"$f":"IF(I15>J15,I15-J15,0)","v":0},{"$f":"IF(C15<=TODAY(),IF(I15<J15,J15-I15,0),0)","v":0},null,null,null,null,null,null,null,null,null,null,null,null,null,{"$f":"IF(AF15<>\"\",IF(E15<>\"\",ABS(24*60*(E15-AF15)),ABS(24*60*(G15-AF15))),0)","v":0},{"$f":"COUNTA(AF15,AI15,AK15,AM15)","v":0},null,{"$f":"IF(AI15<>\"\",IF(H15<>\"\",ABS(24*60*(H15-AI15)),ABS(24*60*(F15-AI15))),0)","v":0},null,{"$f":"IF(AK15<>\"\",IF(E15<>\"\",ABS(24*60*(E15-AK15)),ABS(24*60*(G15-AK15))),0)","v":0},null,{"$f":"IF(AM15<>\"\",IF(H15<>\"\",ABS(24*60*(H15-AM15)),ABS(24*60*(F15-AM15))),0)","v":0},null,null,{"$f":"AQ14+R15-S15","v":0}]
[null,null,"2020-04-03","2020-04-03",null,null,null,null,{"$f":"IF(LEN(F16)+LEN(H16)>0,IF(LEN(H16)>0,(HOUR(F16-E16)+MINUTE(F16-E16)/60)+(HOUR(H16-G16)+MINUTE(H16-G16)/60),(HOUR(F16-E16)+MINUTE(F16-E16)/60)),IF(Parameter!$F$29=1,J16,IF(T16=\"\",0,J16)))","v":0},null,null,null,null,null,null,null,null,{"$f":"IF(I16>J16,I16-J16,0)","v":0},{"$f":"IF(C16<=TODAY(),IF(I16<J16,J16-I16,0),0)","v":0},null,null,null,null,null,null,null,null,null,null,null,null,null,{"$f":"IF(AF16<>\"\",IF(E16<>\"\",ABS(24*60*(E16-AF16)),ABS(24*60*(G16-AF16))),0)","v":0},{"$f":"COUNTA(AF16,AI16,AK16,AM16)","v":0},null,{"$f":"IF(AI16<>\"\",IF(H16<>\"\",ABS(24*60*(H16-AI16)),ABS(24*60*(F16-AI16))),0)","v":0},null,{"$f":"IF(AK16<>\"\",IF(E16<>\"\",ABS(24*60*(E16-AK16)),ABS(24*60*(G16-AK16))),0)","v":0},null,{"$f":"IF(AM16<>\"\",IF(H16<>\"\",ABS(24*60*(H16-AM16)),ABS(24*60*(F16-AM16))),0)","v":0},null,null,{"$f":"AQ15+R16-S16","v":0}]
[null,null,"2020-04-04","2020-04-04",null,null,null,null,{"$f":"IF(LEN(F17)+LEN(H17)>0,IF(LEN(H17)>0,(HOUR(F17-E17)+MINUTE(F17-E17)/60)+(HOUR(H17-G17)+MINUTE(H17-G17)/60),(HOUR(F17-E17)+MINUTE(F17-E17)/60)),IF(Parameter!$F$29=1,J17,IF(T17=\"\",0,J17)))","v":0},null,null,null,null,null,null,null,null,{"$f":"IF(I17>J17,I17-J17,0)","v":0},{"$f":"IF(C17<=TODAY(),IF(I17<J17,J17-I17,0),0)","v":0},null,null,null,null,null,null,null,null,null,null,null,null,null,{"$f":"IF(AF17<>\"\",IF(E17<>\"\",ABS(24*60*(E17-AF17)),ABS(24*60*(G17-AF17))),0)","v":0},{"$f":"COUNTA(AF17,AI17,AK17,AM17)","v":0},null,{"$f":"IF(AI17<>\"\",IF(H17<>\"\",ABS(24*60*(H17-AI17)),ABS(24*60*(F17-AI17))),0)","v":0},null,{"$f":"IF(AK17<>\"\",IF(E17<>\"\",ABS(24*60*(E17-AK17)),ABS(24*60*(G17-AK17))),0)","v":0},null,{"$f":"IF(AM17<>\"\",IF(H17<>\"\",ABS(24*60*(H17-AM17)),ABS(24*60*(F17-AM17))),0)","v":0},null,null,{"$f":"AQ16+R17-S17","v":0}]
[null,null,"2020-04-05","2020-04-05",null,null,null,null,{"$f":"IF(LEN(F18)+LEN(H18)>0,IF(LEN(H18)>0,(HOUR(F18-E18)+MINUTE(F18-E18)/60)+(HOUR(H18-G18)+MINUTE(H18-G18)/60),(HOUR(F18-E18)+MINUTE(F18-E18)/60)),IF(Parameter!$F$29=1,J18,IF(T18=\"\",0,J18)))","v":0},null,null,null,null,null,null,null,null,{"$f":"IF(I18>J18,I18-J18,0)","v":0},{"$f":"IF(C18<=TODAY(),IF(I18<J18,J18-I18,0),0)","v":0},null,null,null,null,null,null,null,null,null,null,null,null,null,{"$f":"IF(AF18<>\"\",IF(E18<>\"\",ABS(24*60*(E18-AF18)),ABS(24*60*(G18-AF18))),0)","v":0},{"$f":"COUNTA(AF18,AI18,AK18,AM18)","v":0},null,{"$f":"IF(AI18<>\"\",IF(H18<>\"\",ABS(24*60*(H18-AI18)),ABS(24*60*(F18-AI18))),0)","v":0},null,{"$f":"IF(AK18<>\"\",IF(E18<>\"\",ABS(24*60*(E18-AK18)),ABS(24*60*(G18-AK18))),0)","v":0},null,{"$f":"IF(AM18<>\"\",IF(H18<>\"\",ABS(24*60*(H18-AM18)),ABS(24*60*(F18-AM18))),0)","v":0},null,null,{"$f":"AQ17+R18-S18","v":0}]
[null,null,"2020-04-06","2020-04-06",null,null,null,null,{"$f":"IF(LEN(F19)+LEN(H19)>0,IF(LEN(H19)>0,(HOUR(F19-E19)+MINUTE(F19-E19)/60)+(HOUR(H19-G19)+MINUTE(H19-G19)/60),(HOUR(F19-E19)+MINUTE(F19-E19)/60)),IF(Parameter!$F$29=1,J19,IF(T19=\"\",0,J19)))","v":0},null,null,null,null,null,null,null,null,{"$f":"IF(I19>J19,I19-J19,0)","v":0},{"$f":"IF(C19<=TODAY(),IF(I19<J19,J19-I19,0),0)","v":0},null,null,null,null,null,null,null,null,null,null,null,null,null,{"$f":"IF(AF19<>\"\",IF(E19<>\"\",ABS(24*60*(E19-AF19)),ABS(24*60*(G19-AF19))),0)","v":0},{"$f":"COUNTA(AF19,AI19,AK19,AM19)","v":0},null,{"$f":"IF(AI19<>\"\",IF(H19<>\"\",ABS(24*60*(H19-AI19)),ABS(24*60*(F19-AI19))),0)","v":0},null,{"$f":"IF(AK19<>\"\",IF(E19<>\"\",ABS(24*60*(E19-AK19)),ABS(24*60*(G19-AK19))),0)","v":0},null,{"$f":"IF(AM19<>\"\",IF(H19<>\"\",ABS(24*60*(H19-AM19)),ABS(24*60*(F19-AM19))),0)","v":0},null,null,{"$f":"AQ18+R19-S19","v":0}]
[null,null,"2020-04-07","2020-04-07",null,null,null,null,{"$f":"IF(LEN(F20)+LEN(H20)>0,IF(LEN(H20)>0,(HOUR(F20-E20)+MINUTE(F20-E20)/60)+(HOUR(H20-G20)+MINUTE(H20-G20)/60),(HOUR(F20-E20)+MINUTE(F20-E20)/60)),IF(Parameter!$F$29=1,J20,IF(T20=\"\",0,J20)))","v":0},null,null,null,null,null,null,null,null,{"$f":"IF(I20>J20,I20-J20,0)","v":0},{"$f":"IF(C20<=TODAY(),IF(I20<J20,J20-I20,0),0)","v":0},null,null,null,null,null,null,null,null,null,null,null,null,null,{"$f":"IF(AF20<>\"\",IF(E20<>\"\",ABS(24*60*(E20-AF20)),ABS(24*60*(G20-AF20))),0)","v":0},{"$f":"COUNTA(AF20,AI20,AK20,AM20)","v":0},null,{"$f":"IF(AI20<>\"\",IF(H20<>\"\",ABS(24*60*(H20-AI20)),ABS(24*60*(F20-AI20))),0)","v":0},null,{"$f":"IF(AK20<>\"\",IF(E20<>\"\",ABS(24*60*(E20-AK20)),ABS(24*60*(G20-AK20))),0)","v":0},null,{"$f":"IF(AM20<>\"\",IF(H20<>\"\",ABS(24*60*(H20-AM20)),ABS(24*60*(F20-AM20))),0)","v":0},null,null,{"$f":"AQ19+R20-S20","v":0}]
[null,null,"2020-04-08","2020-04-08",null,null,null,null,{"$f":"IF(LEN(F21)+LEN(H21)>0,IF(LEN(H21)>0,(HOUR(F21-E21)+MINUTE(F21-E21)/60)+(HOUR(H21-G21)+MINUTE(H21-G21)/60),(HOUR(F21-E21)+MINUTE(F21-E21)/60)),IF(Parameter!$F$29=1,J21,IF(T21=\"\",0,J21)))","v":0},null,null,null,null,null,null,null,null,{"$f":"IF(I21>J21,I21-J21,0)","v":0},{"$f":"IF(C21<=TODAY(),IF(I21<J21,J21-I21,0),0)","v":0},null,null,null,null,null,null,null,null,null,null,null,null,null,{"$f":"IF(AF21<>\"\",IF(E21<>\"\",ABS(24*60*(E21-AF21)),ABS(24*60*(G21-AF21))),0)","v":0},{"$f":"COUNTA(AF21,AI21,AK21,AM21)","v":0},null,{"$f":"IF(AI21<>\"\",IF(H21<>\"\",ABS(24*60*(H21-AI21)),ABS(24*60*(F21-AI21))),0)","v":0},null,{"$f":"IF(AK21<>\"\",IF(E21<>\"\",ABS(24*60*(E21-AK21)),ABS(24*60*(G21-AK21))),0)","v":0},null,{"$f":"IF(AM21<>\"\",IF(H21<>\"\",ABS(24*60*(H21-AM21)),ABS(24*60*(F21-AM21))),0)","v":0},null,null,{"$f":"AQ20+R21-S21","v":0}]
[null,null,"2020-04-09","2020-04-09",null,null,null,null,{"$f":"IF(LEN(F22)+LEN(H22)>0,IF(LEN(H22)>0,(HOUR(F22-E22)+MINUTE(F22-E22)/60)+(HOUR(H22-G22)+MINUTE(H22-G22)/60),(HOUR(F22-E22)+MINUTE(F22-E22)/60)),IF(Parameter!$F$29=1,J22,IF(T22=\"\",0,J22)))","v":0},null,null,null,null,null,null,null,null,{"$f":"IF(I22>J22,I22-J22,0)","v":0},{"$f":"IF(C22<=TODAY(),IF(I22<J22,J22-I22,0),0)","v":0},null,null,null,null,null,null,null,null,null,null,null,null,null,{"$f":"IF(AF22<>\"\",IF(E22<>\"\",ABS(24*60*(E22-AF22)),ABS(24*60*(G22-AF22))),0)","v":0},{"$f":"COUNTA(AF22,AI22,AK22,AM22)","v":0},null,{"$f":"IF(AI22<>\"\",IF(H22<>\"\",ABS(24*60*(H22-AI22)),ABS(24*60*(F22-AI22))),0)","v":0},null,{"$f":"IF(AK22<>\"\",IF(E22<>\"\",ABS(24*60*(E22-AK22)),ABS(24*60*(G22-AK22))),0)","v":0},null,{"$f":"IF(AM22<>\"\",IF(H22<>\"\",ABS(24*60*(H22-AM22)),ABS(24*60*(F22-AM22))),0)","v":0},null,null,{"$f":"AQ21+R22-S22","v":0}]
[null,null,"2020-04-10","2020-04-10",null,null,null,null,{"$f":"IF(LEN(F23)+LEN(H23)>0,IF(LEN(H23)>0,(HOUR(F23-E23)+MINUTE(F23-E23)/60)+(HOUR(H23-G23)+MINUTE(H23-G23)/60),(HOUR(F23-E23)+MINUTE(F23-E23)/60)),IF(Parameter!$F$29=1,J23,IF(T23=\"\",0,J23)))","v":0},null,null,null,null,null,null,null,null,{"$f":"IF(I23>J23,I23-J23,0)","v":0},{"$f":"IF(C23<=TODAY(),IF(I23<J23,J23-I23,0),0)","v":0},null,null,null,null,null,null,null,null,null,null,null,null,null,{"$f":"IF(AF23<>\"\",IF(E23<>\"\",ABS(24*60*(E23-AF23)),ABS(24*60*(G23-AF23))),0)","v":0},{"$f":"COUNTA(AF23,AI23,AK23,AM23)","v":0},null,{"$f":"IF(AI23<>\"\",IF(H23<>\"\",ABS(24*60*(H23-AI23)),ABS(24*60*(F23-AI23))),0)","v":0},null,{"$f":"IF(AK23<>\"\",IF(E23<>\"\",ABS(24*60*(E23-AK23)),ABS(24*60*(G23-AK23))),0)","v":0},null,{"$f":"IF(AM23<>\"\",IF(H23<>\"\",ABS(24*60*(H23-AM23)),ABS(24*60*(F23-AM23))),0)","v":0},null,null,{"$f":"AQ22+R23-S23","v":0}]
[null,null,"2020-04-11","2020-04-11",null,null,null,null,{"$f":"IF(LEN(F24)+LEN(H24)>0,IF(LEN(H24)>0,(HOUR(F24-E24)+MINUTE(F24-E24)/60)+(HOUR(H24-G24)+MINUTE(H24-G24)/60),(HOUR(F24-E24)+MINUTE(F24-E24)/60)),IF(Parameter!$F$29=1,J24,IF(T24=\"\",0,J24)))","v":0},null,null,null,null,null,null,null,null,{"$f":"IF(I24>J24,I24-J24,0)","v":0},{"$f":"IF(C24<=TODAY(),IF(I24<J24,J24-I24,0),0)","v":0},null,null,null,null,null,null,null,null,null,null,null,null,null,{"$f":"IF(AF24<>\"\",IF(E24<>\"\",ABS(24*60*(E24-AF24)),ABS(24*60*(G24-AF24))),0)","v":0},{"$f":"COUNTA(AF24,AI24,AK24,AM24)","v":0},null,{"$f":"IF(AI24<>\"\",IF(H24<>\"\",ABS(24*60*(H24-AI24)),ABS(24*60*(F24-AI24))),0)","v":0},null,{"$f":"IF(AK24<>\"\",IF(E24<>\"\",ABS(24*60*(E24-AK24)),ABS(24*60*(G24-AK24))),0)","v":0},null,{"$f":"IF(AM24<>\"\",IF(H24<>\"\",ABS(24*60*(H24-AM24)),ABS(24*60*(F24-AM24))),0)","v":0},null,null,{"$f":"AQ23+R24-S24","v":0}]
[null,null,"2020-04-12","2020-04-12",null,null,null,null,{"$f":"IF(LEN(F25)+LEN(H25)>0,IF(LEN(H25)>0,(HOUR(F25-E25)+MINUTE(F25-E25)/60)+(HOUR(H25-G25)+MINUTE(H25-G25)/60),(HOUR(F25-E25)+MINUTE(F25-E25)/60)),IF(Parameter!$F$29=1,J25,IF(T25=\"\",0,J25)))","v":0},null,null,null,null,null,null,null,null,{"$f":"IF(I25>J25,I25-J25,0)","v":0},{"$f":"IF(C25<=TODAY(),IF(I25<J25,J25-I25,0),0)","v":0},null,null,null,null,null,null,null,null,null,null,null,null,null,{"$f":"IF(AF25<>\"\",IF(E25<>\"\",ABS(24*60*(E25-AF25)),ABS(24*60*(G25-AF25))),0)","v":0},{"$f":"COUNTA(AF25,AI25,AK25,AM25)","v":0},null,{"$f":"IF(AI25<>\"\",IF(H25<>\"\",ABS(24*60*(H25-AI25)),ABS(24*60*(F25-AI25))),0)","v":0},null,{"$f":"IF(AK25<>\"\",IF(E25<>\"\",ABS(24*60*(E25-AK25)),ABS(24*60*(G25-AK25))),0)","v":0},null,{"$f":"IF(AM25<>\"\",IF(H25<>\"\",ABS(24*60*(H25-AM25)),ABS(24*60*(F25-AM25))),0)","v":0},null,null,{"$f":"AQ24+R25-S25","v":0}]
[null,null,"2020-04-13","2020-04-13",null,null,null,null,{"$f":"IF(LEN(F26)+LEN(H26)>0,IF(LEN(H26)>0,(HOUR(F26-E26)+MINUTE(F26-E26)/60)+(HOUR(H26-G26)+MINUTE(H26-G26)/60),(HOUR(F26-E26)+MINUTE(F26-E26)/60)),IF(Parameter!$F$29=1,J26,IF(T26=\"\",0,J26)))","v":0},null,null,null,null,null,null,null,null,{"$f":"IF(I26>J26,I26-J26,0)","v":0},{"$f":"IF(C26<=TODAY(),IF(I26<J26,J26-I26,0),0)","v":0},null,null,null,null,null,null,null,null,null,null,null,null,null,{"$f":"IF(AF26<>\"\",IF(E26<>\"\",ABS(24*60*(E26-AF26)),ABS(24*60*(G26-AF26))),0)","v":0},{"$f":"COUNTA(AF26,AI26,AK26,AM26)","v":0},null,{"$f":"IF(AI26<>\"\",IF(H26<>\"\",ABS(24*60*(H26-AI26)),ABS(24*60*(F26-AI26))),0)","v":0},null,{"$f":"IF(AK26<>\"\",IF(E26<>\"\",ABS(24*60*(E26-AK26)),ABS(24*60*(G26-AK26))),0)","v":0},null,{"$f":"IF(AM26<>\"\",IF(H26<>\"\",ABS(24*60*(H26-AM26)),ABS(24*60*(F26-AM26))),0)","v":0},null,null,{"$f":"AQ25+R26-S26","v":0}]
[null,null,"2020-04-14","2020-04-14",null,null,null,null,{"$f":"IF(LEN(F27)+LEN(H27)>0,IF(LEN(H27)>0,(HOUR(F27-E27)+MINUTE(F27-E27)/60)+(HOUR(H27-G27)+MINUTE(H27-G27)/60),(HOUR(F27-E27)+MINUTE(F27-E27)/60)),IF(Parameter!$F$29=1,J27,IF(T27=\"\",0,J27)))","v":0},null,null,null,null,null,null,null,null,{"$f":"IF(I27>J27,I27-J27,0)","v":0},{"$f":"IF(C27<=TODAY(),IF(I27<J27,J27-I27,0),0)","v":0},null,null,null,null,null,null,null,null,null,null,null,null,null,{"$f":"IF(AF27<>\"\",IF(E27<>\"\",ABS(24*60*(E27-AF27)),ABS(24*60*(G27-AF27))),0)","v":0},{"$f":"COUNTA(AF27,AI27,AK27,AM27)","v":0},null,{"$f":"IF(AI27<>\"\",IF(H27<>\"\",ABS(24*60*(H27-AI27)),ABS(24*60*(F27-AI27))),0)","v":0},null,{"$f":"IF(AK27<>\"\",IF(E27<>\"\",ABS(24*60*(E27-AK27)),ABS(24*60*(G27-AK27))),0)","v":0},null,{"$f":"IF(AM27<>\"\",IF(H27<>\"\",ABS(24*60*(H27-AM27)),ABS(24*60*(F27-AM27))),0)","v":0},null,null,{"$f":"AQ26+R27-S27","v":0}]
[null,null,"2020-04-15","2020-04-15",null,null,null,null,{"$f":"IF(LEN(F28)+LEN(H28)>0,IF(LEN(H28)>0,(HOUR(F28-E28)+MINUTE(F28-E28)/60)+(HOUR(H28-G28)+MINUTE(H28-G28)/60),(HOUR(F28-E28)+MINUTE(F28-E28)/60)),IF(Parameter!$F$29=1,J28,IF(T28=\"\",0,J28)))","v":0},null,null,null,null,null,null,null,null,{"$f":"IF(I28>J28,I28-J28,0)","v":0},{"$f":"IF(C28<=TODAY(),IF(I28<J28,J28-I28,0),0)","v":0},null,null,null,null,null,null,null,null,null,null,null,null,null,{"$f":"IF(AF28<>\"\",IF(E28<>\"\",ABS(24*60*(E28-AF28)),ABS(24*60*(G28-AF28))),0)","v":0},{"$f":"COUNTA(AF28,AI28,AK28,AM28)","v":0},null,{"$f":"IF(AI28<>\"\",IF(H28<>\"\",ABS(24*60*(H28-AI28)),ABS(24*60*(F28-AI28))),0)","v":0},null,{"$f":"IF(AK28<>\"\",IF(E28<>\"\",ABS(24*60*(E28-AK28)),ABS(24*60*(G28-AK28))),0)","v":0},null,{"$f":"IF(AM28<>\"\",IF(H28<>\"\",ABS(24*60*(H28-AM28)),ABS(24*60*(F28-AM28))),0)","v":0},null,null,{"$f":"AQ27+R28-S28","v":0}]
[null,null,"2020-04-16","2020-04-16",null,null,null,null,{"$f":"IF(LEN(F29)+LEN(H29)>0,IF(LEN(H29)>0,(HOUR(F29-E29)+MINUTE(F29-E29)/60)+(HOUR(H29-G29)+MINUTE(H29-G29)/60),(HOUR(F29-E29)+MINUTE(F29-E29)/60)),IF(Parameter!$F$29=1,J29,IF(T29=\"\",0,J29)))","v":0},null,null,null,null,null,null,null,null,{"$f":"IF(I29>J29,I29-J29,0)","v":0},{"$f":"IF(C29<=TODAY(),IF(I29<J29,J29-I29,0),0)","v":0},null,null,null,null,null,null,null,null,null,null,null,null,null,{"$f":"IF(AF29<>\"\",IF(E29<>\"\",ABS(24*60*(E29-AF29)),ABS(24*60*(G29-AF29))),0)","v":0},{"$f":"COUNTA(AF29,AI29,AK29,AM29)","v":0},null,{"$f":"IF(AI29<>\"\",IF(H29<>\"\",ABS(24*60*(H29-AI29)),ABS(24*60*(F29-AI29))),0)","v":0},null,{"$f":"IF(AK29<>\"\",IF(E29<>\"\",ABS(24*60*(E29-AK29)),ABS(24*60*(G29-AK29))),0)","v":0},null,{"$f":"IF(AM29<>\"\",IF(H29<>\"\",ABS(24*60*(H29-AM29)),ABS(24*60*(F29-AM29))),0)","v":0},null,null,{"$f":"AQ28+R29-S29","v":0}]
[null,null,"2020-04-17","2020-04-17",null,null,null,null,{"$f":"IF(LEN(F30)+LEN(H30)>0,IF(LEN(H30)>0,(HOUR(F30-E30)+MINUTE(F30-E30)/60)+(HOUR(H30-G30)+MINUTE(H30-G30)/60),(HOUR(F30-E30)+MINUTE(F30-E30)/60)),IF(Parameter!$F$29=1,J30,IF(T30=\"\",0,J30)))","v":0},null,null,null,null,null,null,null,null,{"$f":"IF(I30>J30,I30-J30,0)","v":0},{"$f":"IF(C30<=TODAY(),IF(I30<J30,J30-I30,0),0)","v":0},null,null,null,null,null,null,null,null,null,null,null,null,null,{"$f":"IF(AF30<>\"\",IF(E30<>\"\",ABS(24*60*(E30-AF30)),ABS(24*60*(G30-AF30))),0)","v":0},{"$f":"COUNTA(AF30,AI30,AK30,AM30)","v":0},null,{"$f":"IF(AI30<>\"\",IF(H30<>\"\",ABS(24*60*(H30-AI30)),ABS(24*60*(F30-AI30))),0)","v":0},null,{"$f":"IF(AK30<>\"\",IF(E30<>\"\",ABS(24*60*(E30-AK30)),ABS(24*60*(G30-AK30))),0)","v":0},null,{"$f":"IF(AM30<>\"\",IF(H30<>\"\",ABS(24*60*(H30-AM30)),ABS(24*60*(F30-AM30))),0)","v":0},null,null,{"$f":"AQ29+R30-S30","v":0}]
[null,null,"2020-04-18","2020-04-18",null,null,null,null,{"$f":"IF(LEN(F31)+LEN(H31)>0,IF(LEN(H31)>0,(HOUR(F31-E31)+MINUTE(F31-E31)/60)+(HOUR(H31-G31)+MINUTE(H31-G31)/60),(HOUR(F31-E31)+MINUTE(F31-E31)/60)),IF(Parameter!$F$29=1,J31,IF(T31=\"\",0,J31)))","v":0},null,null,null,null,null,null,null,null,{"$f":"IF(I31>J31,I31-J31,0)","v":0},{"$f":"IF(C31<=TODAY(),IF(I31<J31,J31-I31,0),0)","v":0},null,"B",null,null,null,null,null,null,null,null,null,null,null,{"$f":"IF(AF31<>\"\",IF(E31<>\"\",ABS(24*60*(E31-AF31)),ABS(24*60*(G31-AF31))),0)","v":0},{"$f":"COUNTA(AF31,AI31,AK31,AM31)","v":0},null,{"$f":"IF(AI31<>\"\",IF(H31<>\"\",ABS(24*60*(H31-AI31)),ABS(24*60*(F31-AI31))),0)","v":0},null,{"$f":"IF(AK31<>\"\",IF(E31<>\"\",ABS(24*60*(E31-AK31)),ABS(24*60*(G31-AK31))),0)","v":0},null,{"$f":"IF(AM31<>\"\",IF(H31<>\"\",ABS(24*60*(H31-AM31)),ABS(24*60*(F31-AM31))),0)","v":0},null,null,{"$f":"AQ30+R31-S31","v":0}]
[null,null,"2020-04-19","2020-04-19",null,null,null,null,{"$f":"IF(LEN(F32)+LEN(H32)>0,IF(LEN(H32)>0,(HOUR(F32-E32)+MINUTE(F32-E32)/60)+(HOUR(H32-G32)+MINUTE(H32-G32)/60),(HOUR(F32-E32)+MINUTE(F32-E32)/60)),IF(Parameter!$F$29=1,J32,IF(T32=\"\",0,J32)))","v":0},null,null,null,null,null,null,null,null,{"$f":"IF(I32>J32,I32-J32,0)","v":0},{"$f":"IF(C32<=TODAY(),IF(I32<J32,J32-I32,0),0)","v":0},null,null,null,null,null,null,null,null,null,null,null,null,null,{"$f":"IF(AF32<>\"\",IF(E32<>\"\",ABS(24*60*(E32-AF32)),ABS(24*60*(G32-AF32))),0)","v":0},{"$f":"COUNTA(AF32,AI32,AK32,AM32)","v":0},null,{"$f":"IF(AI32<>\"\",IF(H32<>\"\",ABS(24*60*(H32-AI32)),ABS(24*60*(F32-AI32))),0)","v":0},null,{"$f":"IF(AK32<>\"\",IF(E32<>\"\",ABS(24*60*(E32-AK32)),ABS(24*60*(G32-AK32))),0)","v":0},null,{"$f":"IF(AM32<>\"\",IF(H32<>\"\",ABS(24*60*(H32-AM32)),ABS(24*60*(F32-AM32))),0)","v":0},null,null,{"$f":"AQ31+R32-S32","v":0}]
[null,null,"2020-04-20","2020-04-20",null,null,null,null,{"$f":"IF(LEN(F33)+LEN(H33)>0,IF(LEN(H33)>0,(HOUR(F33-E33)+MINUTE(F33-E33)/60)+(HOUR(H33-G33)+MINUTE(H33-G33)/60),(HOUR(F33-E33)+MINUTE(F33-E33)/60)),IF(Parameter!$F$29=1,J33,IF(T33=\"\",0,J33)))","v":0},null,null,null,null,null,null,null,null,{"$f":"IF(I33>J33,I33-J33,0)","v":0},{"$f":"IF(C33<=TODAY(),IF(I33<J33,J33-I33,0),0)","v":0},null,null,null,null,null,null,null,null,null,null,null,null,null,{"$f":"IF(AF33<>\"\",IF(E33<>\"\",ABS(24*60*(E33-AF33)),ABS(24*60*(G33-AF33))),0)","v":0},{"$f":"COUNTA(AF33,AI33,AK33,AM33)","v":0},null,{"$f":"IF(AI33<>\"\",IF(H33<>\"\",ABS(24*60*(H33-AI33)),ABS(24*60*(F33-AI33))),0)","v":0},null,{"$f":"IF(AK33<>\"\",IF(E33<>\"\",ABS(24*60*(E33-AK33)),ABS(24*60*(G33-AK33))),0)","v":0},null,{"$f":"IF(AM33<>\"\",IF(H33<>\"\",ABS(24*60*(H33-AM33)),ABS(24*60*(F33-AM33))),0)","v":0},null,null,{"$f":"AQ32+R33-S33","v":0}]
[null,null,"2020-04-21","2020-04-21",null,null,null,null,{"$f":"IF(LEN(F34)+LEN(H34)>0,IF(LEN(H34)>0,(HOUR(F34-E34)+MINUTE(F34-E34)/60)+(HOUR(H34-G34)+MINUTE(H34-G34)/60),(HOUR(F34-E34)+MINUTE(F34-E34)/60)),IF(Parameter!$F$29=1,J34,IF(T34=\"\",0,J34)))","v":0},null,null,null,null,null,null,null,null,{"$f":"IF(I34>J34,I34-J34,0)","v":0},{"$f":"IF(C34<=TODAY(),IF(I34<J34,J34-I34,0),0)","v":0},null,null,null,null,null,null,null,null,null,null,null,null,null,{"$f":"IF(AF34<>\"\",IF(E34<>\"\",ABS(24*60*(E34-AF34)),ABS(24*60*(G34-AF34))),0)","v":0},{"$f":"COUNTA(AF34,AI34,AK34,AM34)","v":0},null,{"$f":"IF(AI34<>\"\",IF(H34<>\"\",ABS(24*60*(H34-AI34)),ABS(24*60*(F34-AI34))),0)","v":0},null,{"$f":"IF(AK34<>\"\",IF(E34<>\"\",ABS(24*60*(E34-AK34)),ABS(24*60*(G34-AK34))),0)","v":0},null,{"$f":"IF(AM34<>\"\",IF(H34<>\"\",ABS(24*60*(H34-AM34)),ABS(24*60*(F34-AM34))),0)","v":0},null,null,{"$f":"AQ33+R34-S34","v":0}]
[null,null,"2020-04-22","2020-04-22",null,null,null,null,{"$f":"IF(LEN(F35)+LEN(H35)>0,IF(LEN(H35)>0,(HOUR(F35-E35)+MINUTE(F35-E35)/60)+(HOUR(H35-G35)+MINUTE(H35-G35)/60),(HOUR(F35-E35)+MINUTE(F35-E35)/60)),IF(Parameter!$F$29=1,J35,IF(T35=\"\",0,J35)))","v":0},null,null,null,null,null,null,null,null,{"$f":"IF(I35>J35,I35-J35,0)","v":0},{"$f":"IF(C35<=TODAY(),IF(I35<J35,J35-I35,0),0)","v":0},null,null,null,null,null,null,null,null,null,null,null,null,null,{"$f":"IF(AF35<>\"\",IF(E35<>\"\",ABS(24*60*(E35-AF35)),ABS(24*60*(G35-AF35))),0)","v":0},{"$f":"COUNTA(AF35,AI35,AK35,AM35)","v":0},null,{"$f":"IF(AI35<>\"\",IF(H35<>\"\",ABS(24*60*(H35-AI35)),ABS(24*60*(F35-AI35))),0)","v":0},null,{"$f":"IF(AK35<>\"\",IF(E35<>\"\",ABS(24*60*(E35-AK35)),ABS(24*60*(G35-AK35))),0)","v":0},null,{"$f":"IF(AM35<>\"\",IF(H35<>\"\",ABS(24*60*(H35-AM35)),ABS(24*60*(F35-AM35))),0)","v":0},null,null,{"$f":"AQ34+R35-S35","v":0}]
[null,null,"2020-04-23","2020-04-23",null,null,null,null,{"$f":"IF(LEN(F36)+LEN(H36)>0,IF(LEN(H36)>0,(HOUR(F36-E36)+MINUTE(F36-E36)/60)+(HOUR(H36-G36)+MINUTE(H36-G36)/60),(HOUR(F36-E36)+MINUTE(F36-E36)/60)),IF(Parameter!$F$29=1,J36,IF(T36=\"\",0,J36)))","v":0},null,null,null,null,null,null,null,null,{"$f":"IF(I36>J36,I36-J36,0)","v":0},{"$f":"IF(C36<=TODAY(),IF(I36<J36,J36-I36,0),0)","v":0},null,null,null,null,null,null,null,null,null,null,null,null,null,{"$f":"IF(AF36<>\"\",IF(E36<>\"\",ABS(24*60*(E36-AF36)),ABS(24*60*(G36-AF36))),0)","v":0},{"$f":"COUNTA(AF36,AI36,AK36,AM36)","v":0},null,{"$f":"IF(AI36<>\"\",IF(H36<>\"\",ABS(24*60*(H36-AI36)),ABS(24*60*(F36-AI36))),0)","v":0},null,{"$f":"IF(AK36<>\"\",IF(E36<>\"\",ABS(24*60*(E36-AK36)),ABS(24*60*(G36-AK36))),0)","v":0},null,{"$f":"IF(AM36<>\"\",IF(H36<>\"\",ABS(24*60*(H36-AM36)),ABS(24*60*(F36-AM36))),0)","v":0},null,null,{"$f":"AQ35+R36-S36","v":0}]
[null,null,"2020-04-24","2020-04-24",null,null,null,null,{"$f":"IF(LEN(F37)+LEN(H37)>0,IF(LEN(H37)>0,(HOUR(F37-E37)+MINUTE(F37-E37)/60)+(HOUR(H37-G37)+MINUTE(H37-G37)/60),(HOUR(F37-E37)+MINUTE(F37-E37)/60)),IF(Parameter!$F$29=1,J37,IF(T37=\"\",0,J37)))","v":0},null,null,null,null,null,null,null,null,{"$f":"IF(I37>J37,I37-J37,0)","v":0},{"$f":"IF(C37<=TODAY(),IF(I37<J37,J37-I37,0),0)","v":0},null,null,null,null,null,null,null,null,null,null,null,null,null,{"$f":"IF(AF37<>\"\",IF(E37<>\"\",ABS(24*60*(E37-AF37)),ABS(24*60*(G37-AF37))),0)","v":0},{"$f":"COUNTA(AF37,AI37,AK37,AM37)","v":0},null,{"$f":"IF(AI37<>\"\",IF(H37<>\"\",ABS(24*60*(H37-AI37)),ABS(24*60*(F37-AI37))),0)","v":0},null,{"$f":"IF(AK37<>\"\",IF(E37<>\"\",ABS(24*60*(E37-AK37)),ABS(24*60*(G37-AK37))),0)","v":0},null,{"$f":"IF(AM37<>\"\",IF(H37<>\"\",ABS(24*60*(H37-AM37)),ABS(24*60*(F37-AM37))),0)","v":0},null,null,{"$f":"AQ36+R37-S37","v":0}]
[null,null,"2020-04-25","2020-04-25",null,null,null,null,{"$f":"IF(LEN(F38)+LEN(H38)>0,IF(LEN(H38)>0,(HOUR(F38-E38)+MINUTE(F38-E38)/60)+(HOUR(H38-G38)+MINUTE(H38-G38)/60),(HOUR(F38-E38)+MINUTE(F38-E38)/60)),IF(Parameter!$F$29=1,J38,IF(T38=\"\",0,J38)))","v":0},null,null,null,null,null,null,null,null,{"$f":"IF(I38>J38,I38-J38,0)","v":0},{"$f":"IF(C38<=TODAY(),IF(I38<J38,J38-I38,0),0)","v":0},null,null,null,null,null,null,null,null,null,null,null,null,null,{"$f":"IF(AF38<>\"\",IF(E38<>\"\",ABS(24*60*(E38-AF38)),ABS(24*60*(G38-AF38))),0)","v":0},{"$f":"COUNTA(AF38,AI38,AK38,AM38)","v":0},null,{"$f":"IF(AI38<>\"\",IF(H38<>\"\",ABS(24*60*(H38-AI38)),ABS(24*60*(F38-AI38))),0)","v":0},null,{"$f":"IF(AK38<>\"\",IF(E38<>\"\",ABS(24*60*(E38-AK38)),ABS(24*60*(G38-AK38))),0)","v":0},null,{"$f":"IF(AM38<>\"\",IF(H38<>\"\",ABS(24*60*(H38-AM38)),ABS(24*60*(F38-AM38))),0)","v":0},null,null,{"$f":"AQ37+R38-S38","v":0}]
[null,null,"2020-04-26","2020-04-26",null,null,null,null,{"$f":"IF(LEN(F39)+LEN(H39)>0,IF(LEN(H39)>0,(HOUR(F39-E39)+MINUTE(F39-E39)/60)+(HOUR(H39-G39)+MINUTE(H39-G39)/60),(HOUR(F39-E39)+MINUTE(F39-E39)/60)),IF(Parameter!$F$29=1,J39,IF(T39=\"\",0,J39)))","v":0},null,null,null,null,null,null,null,null,{"$f":"IF(I39>J39,I39-J39,0)","v":0},{"$f":"IF(C39<=TODAY(),IF(I39<J39,J39-I39,0),0)","v":0},null,null,null,null,null,null,null,null,null,null,null,null,null,{"$f":"IF(AF39<>\"\",IF(E39<>\"\",ABS(24*60*(E39-AF39)),ABS(24*60*(G39-AF39))),0)","v":0},{"$f":"COUNTA(AF39,AI39,AK39,AM39)","v":0},null,{"$f":"IF(AI39<>\"\",IF(H39<>\"\",ABS(24*60*(H39-AI39)),ABS(24*60*(F39-AI39))),0)","v":0},null,{"$f":"IF(AK39<>\"\",IF(E39<>\"\",ABS(24*60*(E39-AK39)),ABS(24*60*(G39-AK39))),0)","v":0},null,{"$f":"IF(AM39<>\"\",IF(H39<>\"\",ABS(24*60*(H39-AM39)),ABS(24*60*(F39-AM39))),0)","v":0},null,null,{"$f":"AQ38+R39-S39","v":0}]
[null,null,"2020-04-27","2020-04-27",null,null,null,null,{"$f":"IF(LEN(F40)+LEN(H40)>0,IF(LEN(H40)>0,(HOUR(F40-E40)+MINUTE(F40-E40)/60)+(HOUR(H40-G40)+MINUTE(H40-G40)/60),(HOUR(F40-E40)+MINUTE(F40-E40)/60)),IF(Parameter!$F$29=1,J40,IF(T40=\"\",0,J40)))","v":0},null,null,null,null,null,null,null,null,{"$f":"IF(I40>J40,I40-J40,0)","v":0},{"$f":"IF(C40<=TODAY(),IF(I40<J40,J40-I40,0),0)","v":0},null,null,null,null,null,null,null,null,null,null,null,null,null,{"$f":"IF(AF40<>\"\",IF(E40<>\"\",ABS(24*60*(E40-AF40)),ABS(24*60*(G40-AF40))),0)","v":0},{"$f":"COUNTA(AF40,AI40,AK40,AM40)","v":0},null,{"$f":"IF(AI40<>\"\",IF(H40<>\"\",ABS(24*60*(H40-AI40)),ABS(24*60*(F40-AI40))),0)","v":0},null,{"$f":"IF(AK40<>\"\",IF(E40<>\"\",ABS(24*60*(E40-AK40)),ABS(24*60*(G40-AK40))),0)","v":0},null,{"$f":"IF(AM40<>\"\",IF(H40<>\"\",ABS(24*60*(H40-AM40)),ABS(24*60*(F40-AM40))),0)","v":0},null,null,{"$f":"AQ39+R40-S40","v":0}]
[null,null,"2020-04-28","2020-04-28",null,null,null,null,{"$f":"IF(LEN(F41)+LEN(H41)>0,IF(LEN(H41)>0,(HOUR(F41-E41)+MINUTE(F41-E41)/60)+(HOUR(H41-G41)+MINUTE(H41-G41)/60),(HOUR(F41-E41)+MINUTE(F41-E41)/60)),IF(Parameter!$F$29=1,J41,IF(T41=\"\",0,J41)))","v":0},null,null,null,null,null,null,null,null,{"$f":"IF(I41>J41,I41-J41,0)","v":0},{"$f":"IF(C41<=TODAY(),IF(I41<J41,J41-I41,0),0)","v":0},null,null,null,null,null,null,null,null,null,null,null,null,null,{"$f":"IF(AF41<>\"\",IF(E41<>\"\",ABS(24*60*(E41-AF41)),ABS(24*60*(G41-AF41))),0)","v":0},{"$f":"COUNTA(AF41,AI41,AK41,AM41)","v":0},null,{"$f":"IF(AI41<>\"\",IF(H41<>\"\",ABS(24*60*(H41-AI41)),ABS(24*60*(F41-AI41))),0)","v":0},null,{"$f":"IF(AK41<>\"\",IF(E41<>\"\",ABS(24*60*(E41-AK41)),ABS(24*60*(G41-AK41))),0)","v":0},null,{"$f":"IF(AM41<>\"\",IF(H41<>\"\",ABS(24*60*(H41-AM41)),ABS(24*60*(F41-AM41))),0)","v":0},null,null,{"$f":"AQ40+R41-S41","v":0}]
[null,null,"2020-04-29","2020-04-29",null,null,null,null,{"$f":"IF(LEN(F42)+LEN(H42)>0,IF(LEN(H42)>0,(HOUR(F42-E42)+MINUTE(F42-E42)/60)+(HOUR(H42-G42)+MINUTE(H42-G42)/60),(HOUR(F42-E42)+MINUTE(F42-E42)/60)),IF(Parameter!$F$29=1,J42,IF(T42=\"\",0,J42)))","v":0},null,null,null,null,null,null,null,null,{"$f":"IF(I42>J42,I42-J42,0)","v":0},{"$f":"IF(C42<=TODAY(),IF(I42<J42,J42-I42,0),0)","v":0},null,null,null,null,null,null,null,null,null,null,null,null,null,{"$f":"IF(AF42<>\"\",IF(E42<>\"\",ABS(24*60*(E42-AF42)),ABS(24*60*(G42-AF42))),0)","v":0},{"$f":"COUNTA(AF42,AI42,AK42,AM42)","v":0},null,{"$f":"IF(AI42<>\"\",IF(H42<>\"\",ABS(24*60*(H42-AI42)),ABS(24*60*(F42-AI42))),0)","v":0},null,{"$f":"IF(AK42<>\"\",IF(E42<>\"\",ABS(24*60*(E42-AK42)),ABS(24*60*(G42-AK42))),0)","v":0},null,{"$f":"IF(AM42<>\"\",IF(H42<>\"\",ABS(24*60*(H42-AM42)),ABS(24*60*(F42-AM42))),0)","v":0},null,null,{"$f":"AQ41+R42-S42","v":0}]
[null,null,{"$f":"IF(MONTH(C14)<>2,IF(MONTH(C42+1)>MONTH(C42),\"\",C42+1),\"\")","v":"2020-04-30"},"2020-04-30",null,null,null,null,{"$f":"IF(LEN(F43)+LEN(H43)>0,IF(LEN(H43)>0,(HOUR(F43-E43)+MINUTE(F43-E43)/60)+(HOUR(H43-G43)+MINUTE(H43-G43)/60),(HOUR(F43-E43)+MINUTE(F43-E43)/60)),IF(Parameter!$F$29=1,J43,IF(T43=\"\",0,J43)))","v":0},null,null,null,null,null,null,null,null,{"$f":"IF(I43>J43,I43-J43,0)","v":0},{"$f":"IF(C43<=TODAY(),IF(I43<J43,J43-I43,0),0)","v":0},null,null,null,null,null,null,null,null,null,null,null,null,null,{"$f":"IF(AF43<>\"\",IF(E43<>\"\",ABS(24*60*(E43-AF43)),ABS(24*60*(G43-AF43))),0)","v":0},{"$f":"COUNTA(AF43,AI43,AK43,AM43)","v":0},null,{"$f":"IF(AI43<>\"\",IF(H43<>\"\",ABS(24*60*(H43-AI43)),ABS(24*60*(F43-AI43))),0)","v":0},null,{"$f":"IF(AK43<>\"\",IF(E43<>\"\",ABS(24*60*(E43-AK43)),ABS(24*60*(G43-AK43))),0)","v":0},null,{"$f":"IF(AM43<>\"\",IF(H43<>\"\",ABS(24*60*(H43-AM43)),ABS(24*60*(F43-AM43))),0)","v":0},null,null,{"$f":"AQ42+R43-S43","v":0}]
[null,null,{"$f":"IF(MONTH(C14)<>2,IF(MONTH(C43+1)>MONTH(C43),\"\",C43+1),\"\")","v":""},"",null,null,null,null,{"$f":"IF(LEN(F44)+LEN(H44)>0,IF(LEN(H44)>0,(HOUR(F44-E44)+MINUTE(F44-E44)/60)+(HOUR(H44-G44)+MINUTE(H44-G44)/60),(HOUR(F44-E44)+MINUTE(F44-E44)/60)),IF(Parameter!$F$29=1,J44,IF(T44=\"\",0,J44)))","v":0},null,null,null,null,null,null,null,null,{"$f":"IF(I44>J44,I44-J44,0)","v":0},{"$f":"IF(C44<=TODAY(),IF(I44<J44,J44-I44,0),0)","v":0},null,null,null,null,null,null,null,null,null,null,null,null,null,{"$f":"IF(AF44<>\"\",IF(E44<>\"\",ABS(24*60*(E44-AF44)),ABS(24*60*(G44-AF44))),0)","v":0},{"$f":"COUNTA(AF44,AI44,AK44,AM44)","v":0},null,{"$f":"IF(AI44<>\"\",IF(H44<>\"\",ABS(24*60*(H44-AI44)),ABS(24*60*(F44-AI44))),0)","v":0},null,{"$f":"IF(AK44<>\"\",IF(E44<>\"\",ABS(24*60*(E44-AK44)),ABS(24*60*(G44-AK44))),0)","v":0},null,{"$f":"IF(AM44<>\"\",IF(H44<>\"\",ABS(24*60*(H44-AM44)),ABS(24*60*(F44-AM44))),0)","v":0},null,null,{"$f":"AQ43+R44-S44","v":0}]
[null,null,null,null,null,null,null,"Summe:",{"$f":"ROUND(SUM(I14:I44),2)","v":0},{"$f":"ROUND(SUM(J13:J44),2)","v":0},{"$f":"SUM(K14:K44)","v":0},0,0,0,0,0,0,{"$f":"ROUND(SUM(R14:R44),2)","v":0},{"$f":"ROUND(SUM(S14:S44),2)","v":0},{"$f":"IF(COUNTA(T14:T44)=0,\"\",\"/U:\" & COUNTIF(T14:T44,\"u\")&\"/K:\" & COUNTIF(T14:T44,\"k\")&\"/Rest:\" & COUNTA(T14:T44)-COUNTIF(T14:T44,\"u\")-COUNTIF(T14:T44,\"k\"))","v":""},null,null,"Kontrollsummen:",null,null,null,null,null,null,null,null,null,null,null,null,null,null,null,null,null,null,null,null,{"$f":"SUM(AR14:AR44)","v":0},0,0,0,null,0,0,null,"Durchschnitt"]
[null,null,null,null,null,null,null,null,null,null,null,null,null,null,null,null,null,{"$f":"ROUND(R45-S45,2)","v":0},null,"Monatssaldo",null,null,{"$f":"\"IST-Stunden \"&ISTsumme&\" - SOLL-Stunden \"&SOLLsumme&\" =\"","v":"IST-Stunden 0 - SOLL-Stunden 0 ="},null,null,{"$f":"ISTsumme-SOLLsumme","v":0},null,null,null,null,null,null,null,null,null,null,null,null,null,null,null,null,null,null,null,null,null,null,null,null,null,{"$f":"IFERROR(SUM(AZ14:AZ44)/COUNTA(AZ14:AZ44),\"\")","v":""}]
[null,null,"Über-/Mehrstunden",null,null,{"$f":"ROUND(AT45+AU45,2)","v":0},"korr.Endsaldo inkl.Vorperiode:",null,null,null,null,null,null,null,null,null,null,{"$f":"ROUND(R9+R46,2)+F48","v":0},null,"Endsaldo inkl.Vorperiode",null,null,{"$f":"IF(M45<>0,\"minus automatische Überstunden:\",\"Monatssaldo (Zelle R46):\")","v":"Monatssaldo (Zelle R46):"},null,null,{"$f":"IF(M45<>0,-M45,R46)","v":0}]
[null,null,"Zeitsaldo Korrektur",null,null,{"$f":"ROUND((AS45-AT45),2)","v":0},null,null,null,null,null,null,null,null,null,null,null,null,null,"Auszahlung Gutstunden",null,null,{"$f":"IF(M45<>0,\"=Monatssaldo (Zelle R46):\",\"Differenz =\")","v":"Differenz ="},null,null,{"$f":"IF(M45<>0,(Z46+Z47),ROUND(Z46-Z47,1))","v":0}]
[null,null,"Info Lohn: ",null,null,null,null,null,null,null,null,null,null,null,null,null,null,{"$f":"R47-R48","v":0},null,"Vortrag abzgl.Auszahlg.",null,null,{"$f":"IF(M45<>0,\"Differenz =\",\"\")","v":""},null,null,{"$f":"IF(M45<>0,ROUND(Z48-R46,1),\"\")","v":""}]

{"sheet":"5 MAI","index":7,"n_rows":49,"n_cols":75,"rows_kept":49,"cut":false,"hidden":false,"merged":[[2,30,2,32],[2,34,2,35],[2,37,2,38],[11,34,11,35],[11,37,11,38],[10,51,12,51],[46,2,46,4],[47,2,47,4],[47,6,47,9],[10,49,12,49],[47,14,47,16],[47,17,47,18],[46,17,46,18],[45,17,45,18],[10,14,12,14],[10,11,12,11],[10,43,12,43],[44,19,44,20],[10,42,12,42],[46,6,46,16],[47,10,47,13],[10,2,11,2],[11,4,11,5],[7,16,8,16],[10,10,12,10],[7,12,8,12],[7,14,8,14],[7,15,8,15],[10,50,12,50],[10,44,12,44],[10,45,12,45],[10,46,12,46],[10,47,12,47],[10,48,12,48],[0,22,0,26],[2,2,2,18],[45,8,45,9],[10,19,12,19],[10,3,11,3],[8,17,8,18],[10,20,12,20],[5,5,5,8],[6,26,7,26],[8,2,8,3],[8,4,8,8],[11,6,11,7],[45,22,45,24],[5,10,5,13],[7,10,8,10],[7,13,8,13],[5,27,6,27],[8,26,9,26],[10,22,10,26],[11,23,11,24],[11,25,11,26],[5,22,5,24],[11,22,12,22],[48,22,48,24],[46,22,46,24],[45,19,45,21],[46,19,46,21],[47,19,47,21],[48,19,48,21],[47,22,47,24],[5,16,6,16],[48,2,48,3],[48,4,48,9],[5,17,7,18],[10,12,12,12],[10,13,12,13],[10,15,12,15],[10,16,12,16],[48,17,48,18],[7,4,7,8],[5,2,5,4],[7,2,7,3],[11,17,11,18],[10,8,11,9],[10,4,10,7],[7,11,8,11],[2,74,11,74],[2,69,11,69],[2,70,11,70],[2,71,11,71],[2,72,11,72],[2,73,11,73]]}
[]
[]
[null,null,null,null,null,null,null,null,null,null,null,null,null,null,null,null,null,null,null,null,null,null,null,null,null,null,null,null,null,null,null,null,null,null,null,null,null,null,null,null,null,null,null,null,null,null,null,null,null,null,null,null,null,null,null,null,null,null,null,null,null,null,null,null,null,null,null,null,null,{"$f":"IF(AND(Parameter!B69<>\"\"),Parameter!B69&\" \"&Parameter!E69&\"%\",\"\")","v":"Zuschlag vor DP-Beginn 25%"},{"$f":"IF(AND(Parameter!E70<>\"\",Parameter!F70<>\"\"),Parameter!B70&\" \"&TEXT(Parameter!F70,\"hh:mm\")&\" \"&Parameter!E70&\"%\",\"\")","v":"Zuschlag innerhalb DP \nnach 1.Uhrzeit 19:30 50%"},{"$f":"Parameter!B71&\" \"&TEXT(Parameter!F71,\"hh:mm\")&\" \"&Parameter!E71&\"%\"","v":"Zuschlag innerhalb DP \nnach 2.Uhrzeit 21:00 75%"},{"$f":"Parameter!B72&\" \"&TEXT(Parameter!F72,\"hh:mm\")&\" \"&Parameter!E72&\"%\"","v":"Zuschlag außerhalb DP \nnach 1.Uhrzeit 19:30 100%"},{"$f":"Parameter!B73&\" \"&TEXT(Parameter!F73,\"hh:mm\")&\" \"&Parameter!E73&\"%\"","v":"Zuschlag außerhalb DP \nnach 2.Uhrzeit 21:00 125%"},{"$f":"IF(AND(Parameter!B74<>\"\"),Parameter!B74&\" \"&Parameter!E74&\"%\",\"\")","v":"Zuschlag nach DP-Ende 150%"}]
[]
[]
[null,null,"Monat",null,null,{"$f":"MonatsErster+121","v":"2020-05-01"},null,null,null,null,"täglich",null,null,null,"So/Feier","Woche",{"$f":"IF(LEFT(Parameter!J62,1)=\"1\",\"Manuell\",\"Morgen Zeit\")","v":"Manuell"},"Vortrag\nVormonat"]
[]
[null,null,"MitarbeitNr.",null,{"$f":"IF('1 JAN'!E8<>\"\",'1 JAN'!E8,\"\")","v":""},null,null,null,null,null,{"$f":"Parameter!Q50","v":">21:00   100% Üh   "},{"$f":"Parameter!Q52","v":">19:30   50% Üh   "},{"$f":"Parameter!Q54","v":">9h                 50% Üh   "},{"$f":"Parameter!Q56","v":"> Soll-h bis 9 Std.                    50% Üh   "},{"$f":"Parameter!Q58","v":"So/Feiert 100% Üh   "},{"$f":"Parameter!Q60","v":">39h      100% Üh   "},{"$f":"Parameter!Q62","v":"manuell    50% Mh   "}]
[null,null,"Name:",null,{"$f":"IF('1 JAN'!E9<>\"\",'1 JAN'!E9,\"\")","v":""},null,null,null,null,null,null,null,null,null,null,null,null,{"$f":"IF(Parameter!F34=TRUE,'4 APR'!R49:S49,0)","v":0}]
[null,null,null,{"$f":"IF(D16=\"Fr\",\"JA\",\"\")","v":""}]
[null,null,"Datum","Tag","tatsächliche Arbeitszeit",null,null,null," Gesamt\nStunden",null,{"$f":"MID(Parameter!F50,3,99)","v":"Grund-Stunde ZA - Zuschlag auszahlen"},{"$f":"MID(Parameter!F52,3,99)","v":"Grund-Stunde ZA - Zuschlag auszahlen"},{"$f":"MID(Parameter!F54,3,99)","v":"Grund-Stunde ZA - Zuschlag auszahlen"},{"$f":"MID(Parameter!F56,3,99)","v":"Grund-Stunde ZA - Zuschlag auszahlen"},{"$f":"MID(Parameter!F58,3,99)","v":"Grund-Stunde ZA - Zuschlag auszahlen"},{"$f":"MID(Parameter!F60,3,99)","v":"Grund-Stunde ZA - Zuschlag auszahlen"},{"$f":"MID(Parameter!F62,3,99)","v":"Grund-Stunde ZA - Zuschlag auszahlen"},"Gut-","Minus-"," Urlaub\nKrank\n\nU oder K \nmachen","Feiertag\n\nF-ix\nB-ewegl.",null,{"$f":"IF(AND(UPPER(Parameter!G68=\"AKTIV\"),UPPER(Parameter!R69=\"AKTIV\")),\"Dienstplan-Vorschlag übernehmen\",IF(UPPER(Parameter!G68=\"AKTIV\"),\"Dienstplan\",\"Manuelle Zeiterfassung\"))","v":"Manuelle Zeiterfassung"},null,null,null,null,null,null,null,null,null,null,null,null,null,null,null,null,null,null,null,"Aktueller\nTages\nSaldo","Summe Grundstunden\nim Zeitsaldo","Summe \nZuschlag \nZeitsaldo \nerhöhend","Summe Grundstunden\nzur Auszahlung","Summe \nZuschlag\nzur Auszahlung","Korrigierter Tagessaldo","Korrigierte \nTages IST-Std","Differenz SOLL-Std zu IST-Std inkl. Zeitsaldo Korrekturen","Tagesstunden + sonntags Summe Wochen-\nStunden","Wochen\nsumme \n(korrigiert)"]
[null,null,null,null,"Vormittag",null,"Nachmittag",null,null,null,null,null,null,null,null,null,null,"Stunden",null,null,null,null,{"$f":"IF(UPPER(Parameter!G68)=\"AKTIV\",\"Manuelle Zeiten in Spalte W sind monatlich manuell in die Spalten E-H zu übernehmen\",\"Begründung manuelle Zeiterfassung\")","v":"Begründung manuelle Zeiterfassung"},"Vormittag",null,"Nachmittag"]
[null,"OK",null,null,"von","bis","von","bis","Ist","Soll",null,null,null,null,null,null,null,"+","-",null,null,null,null,"von","bis","von","bis",null,null,null,"Anmerkung","Internet AN Vorm.","Differenz","Anzahl Internetzeiten","Internet AB Vorm","Differenz","Internet AN Nachm.","Differenz","Internet AB Nachm.","Differenz",null,null,null,null,null,null,null,null,null,null,null,null,null,null,null,null,null,null,null,null,null,null,null,null,null,null,null,null,null,{"$f":"SUM(BR14:BR44)","v":0},0,0,0,0,0]
[null,null,{"$f":"DATE('1 JAN'!G2,5,1)","v":"2020-05-01"},{"$f":"C14","v":"2020-05-01"},null,null,null,null,{"$f":"IF(LEN(F14)+LEN(H14)>0,IF(LEN(H14)>0,(HOUR(F14-E14)+MINUTE(F14-E14)/60)+(HOUR(H14-G14)+MINUTE(H14-G14)/60),(HOUR(F14-E14)+MINUTE(F14-E14)/60)),IF(Parameter!$F$29=1,J14,IF(T14=\"\",0,J14)))","v":0},null,null,null,null,null,null,null,null,{"$f":"IF(I14>J14,I14-J14,0)","v":0},{"$f":"IF(C14<=TODAY(),IF(I14<J14,J14-I14,0),0)","v":0},null,"F",null,null,null,null,null,null,null,null,null,null,null,{"$f":"IF(AF14<>\"\",IF(E14<>\"\",ABS(24*60*(E14-AF14)),ABS(24*60*(G14-AF14))),0)","v":0},{"$f":"COUNTA(AF14,AI14,AK14,AM14)","v":0},null,{"$f":"IF(AI14<>\"\",IF(H14<>\"\",ABS(24*60*(H14-AI14)),ABS(24*60*(F14-AI14))),0)","v":0},null,{"$f":"IF(AK14<>\"\",IF(E14<>\"\",ABS(24*60*(E14-AK14)),ABS(24*60*(G14-AK14))),0)","v":0},null,{"$f":"IF(AM14<>\"\",IF(H14<>\"\",ABS(24*60*(H14-AM14)),ABS(24*60*(F14-AM14))),0)","v":0},null,null,{"$f":"R9+R14-S14","v":0}]
[null,null,{"$f":"IF(MONTH(C14+1)>MONTH(C14),\"\",C14+1)","v":"2020-05-02"},"2020-05-02",null,null,null,null,{"$f":"IF(LEN(F15)+LEN(H15)>0,IF(LEN(H15)>0,(HOUR(F15-E15)+MINUTE(F15-E15)/60)+(HOUR(H15-G15)+MINUTE(H15-G15)/60),(HOUR(F15-E15)+MINUTE(F15-E15)/60)),IF(Parameter!$F$29=1,J15,IF(T15=\"\",0,J15)))","v":0},null,null,null,null,null,null,null,null,{"$f":"IF(I15>J15,I15-J15,0)","v":0},{"$f":"IF(C15<=TODAY(),IF(I15<J15,J15-I15,0),0)","v":0},null,null,null,null,null,null,null,null,null,null,null,null,null,{"$f":"IF(AF15<>\"\",IF(E15<>\"\",ABS(24*60*(E15-AF15)),ABS(24*60*(G15-AF15))),0)","v":0},{"$f":"COUNTA(AF15,AI15,AK15,AM15)","v":0},null,{"$f":"IF(AI15<>\"\",IF(H15<>\"\",ABS(24*60*(H15-AI15)),ABS(24*60*(F15-AI15))),0)","v":0},null,{"$f":"IF(AK15<>\"\",IF(E15<>\"\",ABS(24*60*(E15-AK15)),ABS(24*60*(G15-AK15))),0)","v":0},null,{"$f":"IF(AM15<>\"\",IF(H15<>\"\",ABS(24*60*(H15-AM15)),ABS(24*60*(F15-AM15))),0)","v":0},null,null,{"$f":"AQ14+R15-S15","v":0}]
[null,null,"2020-05-03","2020-05-03",null,null,null,null,{"$f":"IF(LEN(F16)+LEN(H16)>0,IF(LEN(H16)>0,(HOUR(F16-E16)+MINUTE(F16-E16)/60)+(HOUR(H16-G16)+MINUTE(H16-G16)/60),(HOUR(F16-E16)+MINUTE(F16-E16)/60)),IF(Parameter!$F$29=1,J16,IF(T16=\"\",0,J16)))","v":0},null,null,null,null,null,null,null,null,{"$f":"IF(I16>J16,I16-J16,0)","v":0},{"$f":"IF(C16<=TODAY(),IF(I16<J16,J16-I16,0),0)","v":0},null,null,null,null,null,null,null,null,null,null,null,null,null,{"$f":"IF(AF16<>\"\",IF(E16<>\"\",ABS(24*60*(E16-AF16)),ABS(24*60*(G16-AF16))),0)","v":0},{"$f":"COUNTA(AF16,AI16,AK16,AM16)","v":0},null,{"$f":"IF(AI16<>\"\",IF(H16<>\"\",ABS(24*60*(H16-AI16)),ABS(24*60*(F16-AI16))),0)","v":0},null,{"$f":"IF(AK16<>\"\",IF(E16<>\"\",ABS(24*60*(E16-AK16)),ABS(24*60*(G16-AK16))),0)","v":0},null,{"$f":"IF(AM16<>\"\",IF(H16<>\"\",ABS(24*60*(H16-AM16)),ABS(24*60*(F16-AM16))),0)","v":0},null,null,{"$f":"AQ15+R16-S16","v":0}]
[null,null,"2020-05-04","2020-05-04",null,null,null,null,{"$f":"IF(LEN(F17)+LEN(H17)>0,IF(LEN(H17)>0,(HOUR(F17-E17)+MINUTE(F17-E17)/60)+(HOUR(H17-G17)+MINUTE(H17-G17)/60),(HOUR(F17-E17)+MINUTE(F17-E17)/60)),IF(Parameter!$F$29=1,J17,IF(T17=\"\",0,J17)))","v":0},null,null,null,null,null,null,null,null,{"$f":"IF(I17>J17,I17-J17,0)","v":0},{"$f":"IF(C17<=TODAY(),IF(I17<J17,J17-I17,0),0)","v":0},null,null,null,null,null,null,null,null,null,null,null,null,null,{"$f":"IF(AF17<>\"\",IF(E17<>\"\",ABS(24*60*(E17-AF17)),ABS(24*60*(G17-AF17))),0)","v":0},{"$f":"COUNTA(AF17,AI17,AK17,AM17)","v":0},null,{"$f":"IF(AI17<>\"\",IF(H17<>\"\",ABS(24*60*(H17-AI17)),ABS(24*60*(F17-AI17))),0)","v":0},null,{"$f":"IF(AK17<>\"\",IF(E17<>\"\",ABS(24*60*(E17-AK17)),ABS(24*60*(G17-AK17))),0)","v":0},null,{"$f":"IF(AM17<>\"\",IF(H17<>\"\",ABS(24*60*(H17-AM17)),ABS(24*60*(F17-AM17))),0)","v":0},null,null,{"$f":"AQ16+R17-S17","v":0}]
[null,null,"2020-05-05","2020-05-05",null,null,null,null,{"$f":"IF(LEN(F18)+LEN(H18)>0,IF(LEN(H18)>0,(HOUR(F18-E18)+MINUTE(F18-E18)/60)+(HOUR(H18-G18)+MINUTE(H18-G18)/60),(HOUR(F18-E18)+MINUTE(F18-E18)/60)),IF(Parameter!$F$29=1,J18,IF(T18=\"\",0,J18)))","v":0},null,null,null,null,null,null,null,null,{"$f":"IF(I18>J18,I18-J18,0)","v":0},{"$f":"IF(C18<=TODAY(),IF(I18<J18,J18-I18,0),0)","v":0},null,null,null,null,null,null,null,null,null,null,null,null,null,{"$f":"IF(AF18<>\"\",IF(E18<>\"\",ABS(24*60*(E18-AF18)),ABS(24*60*(G18-AF18))),0)","v":0},{"$f":"COUNTA(AF18,AI18,AK18,AM18)","v":0},null,{"$f":"IF(AI18<>\"\",IF(H18<>\"\",ABS(24*60*(H18-AI18)),ABS(24*60*(F18-AI18))),0)","v":0},null,{"$f":"IF(AK18<>\"\",IF(E18<>\"\",ABS(24*60*(E18-AK18)),ABS(24*60*(G18-AK18))),0)","v":0},null,{"$f":"IF(AM18<>\"\",IF(H18<>\"\",ABS(24*60*(H18-AM18)),ABS(24*60*(F18-AM18))),0)","v":0},null,null,{"$f":"AQ17+R18-S18","v":0}]
[null,null,"2020-05-06","2020-05-06",null,null,null,null,{"$f":"IF(LEN(F19)+LEN(H19)>0,IF(LEN(H19)>0,(HOUR(F19-E19)+MINUTE(F19-E19)/60)+(HOUR(H19-G19)+MINUTE(H19-G19)/60),(HOUR(F19-E19)+MINUTE(F19-E19)/60)),IF(Parameter!$F$29=1,J19,IF(T19=\"\",0,J19)))","v":0},null,null,null,null,null,null,null,null,{"$f":"IF(I19>J19,I19-J19,0)","v":0},{"$f":"IF(C19<=TODAY(),IF(I19<J19,J19-I19,0),0)","v":0},null,null,null,null,null,null,null,null,null,null,null,null,null,{"$f":"IF(AF19<>\"\",IF(E19<>\"\",ABS(24*60*(E19-AF19)),ABS(24*60*(G19-AF19))),0)","v":0},{"$f":"COUNTA(AF19,AI19,AK19,AM19)","v":0},null,{"$f":"IF(AI19<>\"\",IF(H19<>\"\",ABS(24*60*(H19-AI19)),ABS(24*60*(F19-AI19))),0)","v":0},null,{"$f":"IF(AK19<>\"\",IF(E19<>\"\",ABS(24*60*(E19-AK19)),ABS(24*60*(G19-AK19))),0)","v":0},null,{"$f":"IF(AM19<>\"\",IF(H19<>\"\",ABS(24*60*(H19-AM19)),ABS(24*60*(F19-AM19))),0)","v":0},null,null,{"$f":"AQ18+R19-S19","v":0}]
[null,null,"2020-05-07","2020-05-07",null,null,null,null,{"$f":"IF(LEN(F20)+LEN(H20)>0,IF(LEN(H20)>0,(HOUR(F20-E20)+MINUTE(F20-E20)/60)+(HOUR(H20-G20)+MINUTE(H20-G20)/60),(HOUR(F20-E20)+MINUTE(F20-E20)/60)),IF(Parameter!$F$29=1,J20,IF(T20=\"\",0,J20)))","v":0},null,null,null,null,null,null,null,null,{"$f":"IF(I20>J20,I20-J20,0)","v":0},{"$f":"IF(C20<=TODAY(),IF(I20<J20,J20-I20,0),0)","v":0},null,null,null,null,null,null,null,null,null,null,null,null,null,{"$f":"IF(AF20<>\"\",IF(E20<>\"\",ABS(24*60*(E20-AF20)),ABS(24*60*(G20-AF20))),0)","v":0},{"$f":"COUNTA(AF20,AI20,AK20,AM20)","v":0},null,{"$f":"IF(AI20<>\"\",IF(H20<>\"\",ABS(24*60*(H20-AI20)),ABS(24*60*(F20-AI20))),0)","v":0},null,{"$f":"IF(AK20<>\"\",IF(E20<>\"\",ABS(24*60*(E20-AK20)),ABS(24*60*(G20-AK20))),0)","v":0},null,{"$f":"IF(AM20<>\"\",IF(H20<>\"\",ABS(24*60*(H20-AM20)),ABS(24*60*(F20-AM20))),0)","v":0},null,null,{"$f":"AQ19+R20-S20","v":0}]
[null,null,"2020-05-08","2020-05-08",null,null,null,null,{"$f":"IF(LEN(F21)+LEN(H21)>0,IF(LEN(H21)>0,(HOUR(F21-E21)+MINUTE(F21-E21)/60)+(HOUR(H21-G21)+MINUTE(H21-G21)/60),(HOUR(F21-E21)+MINUTE(F21-E21)/60)),IF(Parameter!$F$29=1,J21,IF(T21=\"\",0,J21)))","v":0},null,null,null,null,null,null,null,null,{"$f":"IF(I21>J21,I21-J21,0)","v":0},{"$f":"IF(C21<=TODAY(),IF(I21<J21,J21-I21,0),0)","v":0},null,null,null,null,null,null,null,null,null,null,null,null,null,{"$f":"IF(AF21<>\"\",IF(E21<>\"\",ABS(24*60*(E21-AF21)),ABS(24*60*(G21-AF21))),0)","v":0},{"$f":"COUNTA(AF21,AI21,AK21,AM21)","v":0},null,{"$f":"IF(AI21<>\"\",IF(H21<>\"\",ABS(24*60*(H21-AI21)),ABS(24*60*(F21-AI21))),0)","v":0},null,{"$f":"IF(AK21<>\"\",IF(E21<>\"\",ABS(24*60*(E21-AK21)),ABS(24*60*(G21-AK21))),0)","v":0},null,{"$f":"IF(AM21<>\"\",IF(H21<>\"\",ABS(24*60*(H21-AM21)),ABS(24*60*(F21-AM21))),0)","v":0},null,null,{"$f":"AQ20+R21-S21","v":0}]
[null,null,"2020-05-09","2020-05-09",null,null,null,null,{"$f":"IF(LEN(F22)+LEN(H22)>0,IF(LEN(H22)>0,(HOUR(F22-E22)+MINUTE(F22-E22)/60)+(HOUR(H22-G22)+MINUTE(H22-G22)/60),(HOUR(F22-E22)+MINUTE(F22-E22)/60)),IF(Parameter!$F$29=1,J22,IF(T22=\"\",0,J22)))","v":0},null,null,null,null,null,null,null,null,{"$f":"IF(I22>J22,I22-J22,0)","v":0},{"$f":"IF(C22<=TODAY(),IF(I22<J22,J22-I22,0),0)","v":0},null,null,null,null,null,null,null,null,null,null,null,null,null,{"$f":"IF(AF22<>\"\",IF(E22<>\"\",ABS(24*60*(E22-AF22)),ABS(24*60*(G22-AF22))),0)","v":0},{"$f":"COUNTA(AF22,AI22,AK22,AM22)","v":0},null,{"$f":"IF(AI22<>\"\",IF(H22<>\"\",ABS(24*60*(H22-AI22)),ABS(24*60*(F22-AI22))),0)","v":0},null,{"$f":"IF(AK22<>\"\",IF(E22<>\"\",ABS(24*60*(E22-AK22)),ABS(24*60*(G22-AK22))),0)","v":0},null,{"$f":"IF(AM22<>\"\",IF(H22<>\"\",ABS(24*60*(H22-AM22)),ABS(24*60*(F22-AM22))),0)","v":0},null,null,{"$f":"AQ21+R22-S22","v":0}]
[null,null,"2020-05-10","2020-05-10",null,null,null,null,{"$f":"IF(LEN(F23)+LEN(H23)>0,IF(LEN(H23)>0,(HOUR(F23-E23)+MINUTE(F23-E23)/60)+(HOUR(H23-G23)+MINUTE(H23-G23)/60),(HOUR(F23-E23)+MINUTE(F23-E23)/60)),IF(Parameter!$F$29=1,J23,IF(T23=\"\",0,J23)))","v":0},null,null,null,null,null,null,null,null,{"$f":"IF(I23>J23,I23-J23,0)","v":0},{"$f":"IF(C23<=TODAY(),IF(I23<J23,J23-I23,0),0)","v":0},null,null,null,null,null,null,null,null,null,null,null,null,null,{"$f":"IF(AF23<>\"\",IF(E23<>\"\",ABS(24*60*(E23-AF23)),ABS(24*60*(G23-AF23))),0)","v":0},{"$f":"COUNTA(AF23,AI23,AK23,AM23)","v":0},null,{"$f":"IF(AI23<>\"\",IF(H23<>\"\",ABS(24*60*(H23-AI23)),ABS(24*60*(F23-AI23))),0)","v":0},null,{"$f":"IF(AK23<>\"\",IF(E23<>\"\",ABS(24*60*(E23-AK23)),ABS(24*60*(G23-AK23))),0)","v":0},null,{"$f":"IF(AM23<>\"\",IF(H23<>\"\",ABS(24*60*(H23-AM23)),ABS(24*60*(F23-AM23))),0)","v":0},null,null,{"$f":"AQ22+R23-S23","v":0}]
[null,null,"2020-05-11","2020-05-11",null,null,null,null,{"$f":"IF(LEN(F24)+LEN(H24)>0,IF(LEN(H24)>0,(HOUR(F24-E24)+MINUTE(F24-E24)/60)+(HOUR(H24-G24)+MINUTE(H24-G24)/60),(HOUR(F24-E24)+MINUTE(F24-E24)/60)),IF(Parameter!$F$29=1,J24,IF(T24=\"\",0,J24)))","v":0},null,null,null,null,null,null,null,null,{"$f":"IF(I24>J24,I24-J24,0)","v":0},{"$f":"IF(C24<=TODAY(),IF(I24<J24,J24-I24,0),0)","v":0},null,null,null,null,null,null,null,null,null,null,null,null,null,{"$f":"IF(AF24<>\"\",IF(E24<>\"\",ABS(24*60*(E24-AF24)),ABS(24*60*(G24-AF24))),0)","v":0},{"$f":"COUNTA(AF24,AI24,AK24,AM24)","v":0},null,{"$f":"IF(AI24<>\"\",IF(H24<>\"\",ABS(24*60*(H24-AI24)),ABS(24*60*(F24-AI24))),0)","v":0},null,{"$f":"IF(AK24<>\"\",IF(E24<>\"\",ABS(24*60*(E24-AK24)),ABS(24*60*(G24-AK24))),0)","v":0},null,{"$f":"IF(AM24<>\"\",IF(H24<>\"\",ABS(24*60*(H24-AM24)),ABS(24*60*(F24-AM24))),0)","v":0},null,null,{"$f":"AQ23+R24-S24","v":0}]
[null,null,"2020-05-12","2020-05-12",null,null,null,null,{"$f":"IF(LEN(F25)+LEN(H25)>0,IF(LEN(H25)>0,(HOUR(F25-E25)+MINUTE(F25-E25)/60)+(HOUR(H25-G25)+MINUTE(H25-G25)/60),(HOUR(F25-E25)+MINUTE(F25-E25)/60)),IF(Parameter!$F$29=1,J25,IF(T25=\"\",0,J25)))","v":0},null,null,null,null,null,null,null,null,{"$f":"IF(I25>J25,I25-J25,0)","v":0},{"$f":"IF(C25<=TODAY(),IF(I25<J25,J25-I25,0),0)","v":0},null,null,null,null,null,null,null,null,null,null,null,null,null,{"$f":"IF(AF25<>\"\",IF(E25<>\"\",ABS(24*60*(E25-AF25)),ABS(24*60*(G25-AF25))),0)","v":0},{"$f":"COUNTA(AF25,AI25,AK25,AM25)","v":0},null,{"$f":"IF(AI25<>\"\",IF(H25<>\"\",ABS(24*60*(H25-AI25)),ABS(24*60*(F25-AI25))),0)","v":0},null,{"$f":"IF(AK25<>\"\",IF(E25<>\"\",ABS(24*60*(E25-AK25)),ABS(24*60*(G25-AK25))),0)","v":0},null,{"$f":"IF(AM25<>\"\",IF(H25<>\"\",ABS(24*60*(H25-AM25)),ABS(24*60*(F25-AM25))),0)","v":0},null,null,{"$f":"AQ24+R25-S25","v":0}]
[null,null,"2020-05-13","2020-05-13",null,null,null,null,{"$f":"IF(LEN(F26)+LEN(H26)>0,IF(LEN(H26)>0,(HOUR(F26-E26)+MINUTE(F26-E26)/60)+(HOUR(H26-G26)+MINUTE(H26-G26)/60),(HOUR(F26-E26)+MINUTE(F26-E26)/60)),IF(Parameter!$F$29=1,J26,IF(T26=\"\",0,J26)))","v":0},null,null,null,null,null,null,null,null,{"$f":"IF(I26>J26,I26-J26,0)","v":0},{"$f":"IF(C26<=TODAY(),IF(I26<J26,J26-I26,0),0)","v":0},null,null,null,null,null,null,null,null,null,null,null,null,null,{"$f":"IF(AF26<>\"\",IF(E26<>\"\",ABS(24*60*(E26-AF26)),ABS(24*60*(G26-AF26))),0)","v":0},{"$f":"COUNTA(AF26,AI26,AK26,AM26)","v":0},null,{"$f":"IF(AI26<>\"\",IF(H26<>\"\",ABS(24*60*(H26-AI26)),ABS(24*60*(F26-AI26))),0)","v":0},null,{"$f":"IF(AK26<>\"\",IF(E26<>\"\",ABS(24*60*(E26-AK26)),ABS(24*60*(G26-AK26))),0)","v":0},null,{"$f":"IF(AM26<>\"\",IF(H26<>\"\",ABS(24*60*(H26-AM26)),ABS(24*60*(F26-AM26))),0)","v":0},null,null,{"$f":"AQ25+R26-S26","v":0}]
[null,null,"2020-05-14","2020-05-14",null,null,null,null,{"$f":"IF(LEN(F27)+LEN(H27)>0,IF(LEN(H27)>0,(HOUR(F27-E27)+MINUTE(F27-E27)/60)+(HOUR(H27-G27)+MINUTE(H27-G27)/60),(HOUR(F27-E27)+MINUTE(F27-E27)/60)),IF(Parameter!$F$29=1,J27,IF(T27=\"\",0,J27)))","v":0},null,null,null,null,null,null,null,null,{"$f":"IF(I27>J27,I27-J27,0)","v":0},{"$f":"IF(C27<=TODAY(),IF(I27<J27,J27-I27,0),0)","v":0},null,null,null,null,null,null,null,null,null,null,null,null,null,{"$f":"IF(AF27<>\"\",IF(E27<>\"\",ABS(24*60*(E27-AF27)),ABS(24*60*(G27-AF27))),0)","v":0},{"$f":"COUNTA(AF27,AI27,AK27,AM27)","v":0},null,{"$f":"IF(AI27<>\"\",IF(H27<>\"\",ABS(24*60*(H27-AI27)),ABS(24*60*(F27-AI27))),0)","v":0},null,{"$f":"IF(AK27<>\"\",IF(E27<>\"\",ABS(24*60*(E27-AK27)),ABS(24*60*(G27-AK27))),0)","v":0},null,{"$f":"IF(AM27<>\"\",IF(H27<>\"\",ABS(24*60*(H27-AM27)),ABS(24*60*(F27-AM27))),0)","v":0},null,null,{"$f":"AQ26+R27-S27","v":0}]
[null,null,"2020-05-15","2020-05-15",null,null,null,null,{"$f":"IF(LEN(F28)+LEN(H28)>0,IF(LEN(H28)>0,(HOUR(F28-E28)+MINUTE(F28-E28)/60)+(HOUR(H28-G28)+MINUTE(H28-G28)/60),(HOUR(F28-E28)+MINUTE(F28-E28)/60)),IF(Parameter!$F$29=1,J28,IF(T28=\"\",0,J28)))","v":0},null,null,null,null,null,null,null,null,{"$f":"IF(I28>J28,I28-J28,0)","v":0},{"$f":"IF(C28<=TODAY(),IF(I28<J28,J28-I28,0),0)","v":0},null,null,null,null,null,null,null,null,null,null,null,null,null,{"$f":"IF(AF28<>\"\",IF(E28<>\"\",ABS(24*60*(E28-AF28)),ABS(24*60*(G28-AF28))),0)","v":0},{"$f":"COUNTA(AF28,AI28,AK28,AM28)","v":0},null,{"$f":"IF(AI28<>\"\",IF(H28<>\"\",ABS(24*60*(H28-AI28)),ABS(24*60*(F28-AI28))),0)","v":0},null,{"$f":"IF(AK28<>\"\",IF(E28<>\"\",ABS(24*60*(E28-AK28)),ABS(24*60*(G28-AK28))),0)","v":0},null,{"$f":"IF(AM28<>\"\",IF(H28<>\"\",ABS(24*60*(H28-AM28)),ABS(24*60*(F28-AM28))),0)","v":0},null,null,{"$f":"AQ27+R28-S28","v":0}]
[null,null,"2020-05-16","2020-05-16",null,null,null,null,{"$f":"IF(LEN(F29)+LEN(H29)>0,IF(LEN(H29)>0,(HOUR(F29-E29)+MINUTE(F29-E29)/60)+(HOUR(H29-G29)+MINUTE(H29-G29)/60),(HOUR(F29-E29)+MINUTE(F29-E29)/60)),IF(Parameter!$F$29=1,J29,IF(T29=\"\",0,J29)))","v":0},null,null,null,null,null,null,null,null,{"$f":"IF(I29>J29,I29-J29,0)","v":0},{"$f":"IF(C29<=TODAY(),IF(I29<J29,J29-I29,0),0)","v":0},null,null,null,null,null,null,null,null,null,null,null,null,null,{"$f":"IF(AF29<>\"\",IF(E29<>\"\",ABS(24*60*(E29-AF29)),ABS(24*60*(G29-AF29))),0)","v":0},{"$f":"COUNTA(AF29,AI29,AK29,AM29)","v":0},null,{"$f":"IF(AI29<>\"\",IF(H29<>\"\",ABS(24*60*(H29-AI29)),ABS(24*60*(F29-AI29))),0)","v":0},null,{"$f":"IF(AK29<>\"\",IF(E29<>\"\",ABS(24*60*(E29-AK29)),ABS(24*60*(G29-AK29))),0)","v":0},null,{"$f":"IF(AM29<>\"\",IF(H29<>\"\",ABS(24*60*(H29-AM29)),ABS(24*60*(F29-AM29))),0)","v":0},null,null,{"$f":"AQ28+R29-S29","v":0}]
[null,null,"2020-05-17","2020-05-17",null,null,null,null,{"$f":"IF(LEN(F30)+LEN(H30)>0,IF(LEN(H30)>0,(HOUR(F30-E30)+MINUTE(F30-E30)/60)+(HOUR(H30-G30)+MINUTE(H30-G30)/60),(HOUR(F30-E30)+MINUTE(F30-E30)/60)),IF(Parameter!$F$29=1,J30,IF(T30=\"\",0,J30)))","v":0},null,null,null,null,null,null,null,null,{"$f":"IF(I30>J30,I30-J30,0)","v":0},{"$f":"IF(C30<=TODAY(),IF(I30<J30,J30-I30,0),0)","v":0},null,null,null,null,null,null,null,null,null,null,null,null,null,{"$f":"IF(AF30<>\"\",IF(E30<>\"\",ABS(24*60*(E30-AF30)),ABS(24*60*(G30-AF30))),0)","v":0},{"$f":"COUNTA(AF30,AI30,AK30,AM30)","v":0},null,{"$f":"IF(AI30<>\"\",IF(H30<>\"\",ABS(24*60*(H30-AI30)),ABS(24*60*(F30-AI30))),0)","v":0},null,{"$f":"IF(AK30<>\"\",IF(E30<>\"\",ABS(24*60*(E30-AK30)),ABS(24*60*(G30-AK30))),0)","v":0},null,{"$f":"IF(AM30<>\"\",IF(H30<>\"\",ABS(24*60*(H30-AM30)),ABS(24*60*(F30-AM30))),0)","v":0},null,null,{"$f":"AQ29+R30-S30","v":0}]
[null,null,"2020-05-18","2020-05-18",null,null,null,null,{"$f":"IF(LEN(F31)+LEN(H31)>0,IF(LEN(H31)>0,(HOUR(F31-E31)+MINUTE(F31-E31)/60)+(HOUR(H31-G31)+MINUTE(H31-G31)/60),(HOUR(F31-E31)+MINUTE(F31-E31)/60)),IF(Parameter!$F$29=1,J31,IF(T31=\"\",0,J31)))","v":0},null,null,null,null,null,null,null,null,{"$f":"IF(I31>J31,I31-J31,0)","v":0},{"$f":"IF(C31<=TODAY(),IF(I31<J31,J31-I31,0),0)","v":0},null,null,null,null,null,null,null,null,null,null,null,null,null,{"$f":"IF(AF31<>\"\",IF(E31<>\"\",ABS(24*60*(E31-AF31)),ABS(24*60*(G31-AF31))),0)","v":0},{"$f":"COUNTA(AF31,AI31,AK31,AM31)","v":0},null,{"$f":"IF(AI31<>\"\",IF(H31<>\"\",ABS(24*60*(H31-AI31)),ABS(24*60*(F31-AI31))),0)","v":0},null,{"$f":"IF(AK31<>\"\",IF(E31<>\"\",ABS(24*60*(E31-AK31)),ABS(24*60*(G31-AK31))),0)","v":0},null,{"$f":"IF(AM31<>\"\",IF(H31<>\"\",ABS(24*60*(H31-AM31)),ABS(24*60*(F31-AM31))),0)","v":0},null,null,{"$f":"AQ30+R31-S31","v":0}]
[null,null,"2020-05-19","2020-05-19",null,null,null,null,{"$f":"IF(LEN(F32)+LEN(H32)>0,IF(LEN(H32)>0,(HOUR(F32-E32)+MINUTE(F32-E32)/60)+(HOUR(H32-G32)+MINUTE(H32-G32)/60),(HOUR(F32-E32)+MINUTE(F32-E32)/60)),IF(Parameter!$F$29=1,J32,IF(T32=\"\",0,J32)))","v":0},null,null,null,null,null,null,null,null,{"$f":"IF(I32>J32,I32-J32,0)","v":0},{"$f":"IF(C32<=TODAY(),IF(I32<J32,J32-I32,0),0)","v":0},null,null,null,null,null,null,null,null,null,null,null,null,null,{"$f":"IF(AF32<>\"\",IF(E32<>\"\",ABS(24*60*(E32-AF32)),ABS(24*60*(G32-AF32))),0)","v":0},{"$f":"COUNTA(AF32,AI32,AK32,AM32)","v":0},null,{"$f":"IF(AI32<>\"\",IF(H32<>\"\",ABS(24*60*(H32-AI32)),ABS(24*60*(F32-AI32))),0)","v":0},null,{"$f":"IF(AK32<>\"\",IF(E32<>\"\",ABS(24*60*(E32-AK32)),ABS(24*60*(G32-AK32))),0)","v":0},null,{"$f":"IF(AM32<>\"\",IF(H32<>\"\",ABS(24*60*(H32-AM32)),ABS(24*60*(F32-AM32))),0)","v":0},null,null,{"$f":"AQ31+R32-S32","v":0}]
[null,null,"2020-05-20","2020-05-20",null,null,null,null,{"$f":"IF(LEN(F33)+LEN(H33)>0,IF(LEN(H33)>0,(HOUR(F33-E33)+MINUTE(F33-E33)/60)+(HOUR(H33-G33)+MINUTE(H33-G33)/60),(HOUR(F33-E33)+MINUTE(F33-E33)/60)),IF(Parameter!$F$29=1,J33,IF(T33=\"\",0,J33)))","v":0},null,null,null,null,null,null,null,null,{"$f":"IF(I33>J33,I33-J33,0)","v":0},{"$f":"IF(C33<=TODAY(),IF(I33<J33,J33-I33,0),0)","v":0},null,null,null,null,null,null,null,null,null,null,null,null,null,{"$f":"IF(AF33<>\"\",IF(E33<>\"\",ABS(24*60*(E33-AF33)),ABS(24*60*(G33-AF33))),0)","v":0},{"$f":"COUNTA(AF33,AI33,AK33,AM33)","v":0},null,{"$f":"IF(AI33<>\"\",IF(H33<>\"\",ABS(24*60*(H33-AI33)),ABS(24*60*(F33-AI33))),0)","v":0},null,{"$f":"IF(AK33<>\"\",IF(E33<>\"\",ABS(24*60*(E33-AK33)),ABS(24*60*(G33-AK33))),0)","v":0},null,{"$f":"IF(AM33<>\"\",IF(H33<>\"\",ABS(24*60*(H33-AM33)),ABS(24*60*(F33-AM33))),0)","v":0},null,null,{"$f":"AQ32+R33-S33","v":0}]
[null,null,"2020-05-21","2020-05-21",null,null,null,null,{"$f":"IF(LEN(F34)+LEN(H34)>0,IF(LEN(H34)>0,(HOUR(F34-E34)+MINUTE(F34-E34)/60)+(HOUR(H34-G34)+MINUTE(H34-G34)/60),(HOUR(F34-E34)+MINUTE(F34-E34)/60)),IF(Parameter!$F$29=1,J34,IF(T34=\"\",0,J34)))","v":0},null,null,null,null,null,null,null,null,{"$f":"IF(I34>J34,I34-J34,0)","v":0},{"$f":"IF(C34<=TODAY(),IF(I34<J34,J34-I34,0),0)","v":0},null,null,null,null,null,null,null,null,null,null,null,null,null,{"$f":"IF(AF34<>\"\",IF(E34<>\"\",ABS(24*60*(E34-AF34)),ABS(24*60*(G34-AF34))),0)","v":0},{"$f":"COUNTA(AF34,AI34,AK34,AM34)","v":0},null,{"$f":"IF(AI34<>\"\",IF(H34<>\"\",ABS(24*60*(H34-AI34)),ABS(24*60*(F34-AI34))),0)","v":0},null,{"$f":"IF(AK34<>\"\",IF(E34<>\"\",ABS(24*60*(E34-AK34)),ABS(24*60*(G34-AK34))),0)","v":0},null,{"$f":"IF(AM34<>\"\",IF(H34<>\"\",ABS(24*60*(H34-AM34)),ABS(24*60*(F34-AM34))),0)","v":0},null,null,{"$f":"AQ33+R34-S34","v":0}]
[null,null,"2020-05-22","2020-05-22",null,null,null,null,{"$f":"IF(LEN(F35)+LEN(H35)>0,IF(LEN(H35)>0,(HOUR(F35-E35)+MINUTE(F35-E35)/60)+(HOUR(H35-G35)+MINUTE(H35-G35)/60),(HOUR(F35-E35)+MINUTE(F35-E35)/60)),IF(Parameter!$F$29=1,J35,IF(T35=\"\",0,J35)))","v":0},null,null,null,null,null,null,null,null,{"$f":"IF(I35>J35,I35-J35,0)","v":0},{"$f":"IF(C35<=TODAY(),IF(I35<J35,J35-I35,0),0)","v":0},null,null,null,null,null,null,null,null,null,null,null,null,null,{"$f":"IF(AF35<>\"\",IF(E35<>\"\",ABS(24*60*(E35-AF35)),ABS(24*60*(G35-AF35))),0)","v":0},{"$f":"COUNTA(AF35,AI35,AK35,AM35)","v":0},null,{"$f":"IF(AI35<>\"\",IF(H35<>\"\",ABS(24*60*(H35-AI35)),ABS(24*60*(F35-AI35))),0)","v":0},null,{"$f":"IF(AK35<>\"\",IF(E35<>\"\",ABS(24*60*(E35-AK35)),ABS(24*60*(G35-AK35))),0)","v":0},null,{"$f":"IF(AM35<>\"\",IF(H35<>\"\",ABS(24*60*(H35-AM35)),ABS(24*60*(F35-AM35))),0)","v":0},null,null,{"$f":"AQ34+R35-S35","v":0}]
[null,null,"2020-05-23","2020-05-23",null,null,null,null,{"$f":"IF(LEN(F36)+LEN(H36)>0,IF(LEN(H36)>0,(HOUR(F36-E36)+MINUTE(F36-E36)/60)+(HOUR(H36-G36)+MINUTE(H36-G36)/60),(HOUR(F36-E36)+MINUTE(F36-E36)/60)),IF(Parameter!$F$29=1,J36,IF(T36=\"\",0,J36)))","v":0},null,null,null,null,null,null,null,null,{"$f":"IF(I36>J36,I36-J36,0)","v":0},{"$f":"IF(C36<=TODAY(),IF(I36<J36,J36-I36,0),0)","v":0},null,null,null,null,null,null,null,null,null,null,null,null,null,{"$f":"IF(AF36<>\"\",IF(E36<>\"\",ABS(24*60*(E36-AF36)),ABS(24*60*(G36-AF36))),0)","v":0},{"$f":"COUNTA(AF36,AI36,AK36,AM36)","v":0},null,{"$f":"IF(AI36<>\"\",IF(H36<>\"\",ABS(24*60*(H36-AI36)),ABS(24*60*(F36-AI36))),0)","v":0},null,{"$f":"IF(AK36<>\"\",IF(E36<>\"\",ABS(24*60*(E36-AK36)),ABS(24*60*(G36-AK36))),0)","v":0},null,{"$f":"IF(AM36<>\"\",IF(H36<>\"\",ABS(24*60*(H36-AM36)),ABS(24*60*(F36-AM36))),0)","v":0},null,null,{"$f":"AQ35+R36-S36","v":0}]
[null,null,"2020-05-24","2020-05-24",null,null,null,null,{"$f":"IF(LEN(F37)+LEN(H37)>0,IF(LEN(H37)>0,(HOUR(F37-E37)+MINUTE(F37-E37)/60)+(HOUR(H37-G37)+MINUTE(H37-G37)/60),(HOUR(F37-E37)+MINUTE(F37-E37)/60)),IF(Parameter!$F$29=1,J37,IF(T37=\"\",0,J37)))","v":0},null,null,null,null,null,null,null,null,{"$f":"IF(I37>J37,I37-J37,0)","v":0},{"$f":"IF(C37<=TODAY(),IF(I37<J37,J37-I37,0),0)","v":0},null,null,null,null,null,null,null,null,null,null,null,null,null,{"$f":"IF(AF37<>\"\",IF(E37<>\"\",ABS(24*60*(E37-AF37)),ABS(24*60*(G37-AF37))),0)","v":0},{"$f":"COUNTA(AF37,AI37,AK37,AM37)","v":0},null,{"$f":"IF(AI37<>\"\",IF(H37<>\"\",ABS(24*60*(H37-AI37)),ABS(24*60*(F37-AI37))),0)","v":0},null,{"$f":"IF(AK37<>\"\",IF(E37<>\"\",ABS(24*60*(E37-AK37)),ABS(24*60*(G37-AK37))),0)","v":0},null,{"$f":"IF(AM37<>\"\",IF(H37<>\"\",ABS(24*60*(H37-AM37)),ABS(24*60*(F37-AM37))),0)","v":0},null,null,{"$f":"AQ36+R37-S37","v":0}]
[null,null,"2020-05-25","2020-05-25",null,null,null,null,{"$f":"IF(LEN(F38)+LEN(H38)>0,IF(LEN(H38)>0,(HOUR(F38-E38)+MINUTE(F38-E38)/60)+(HOUR(H38-G38)+MINUTE(H38-G38)/60),(HOUR(F38-E38)+MINUTE(F38-E38)/60)),IF(Parameter!$F$29=1,J38,IF(T38=\"\",0,J38)))","v":0},null,null,null,null,null,null,null,null,{"$f":"IF(I38>J38,I38-J38,0)","v":0},{"$f":"IF(C38<=TODAY(),IF(I38<J38,J38-I38,0),0)","v":0},null,null,null,null,null,null,null,null,null,null,null,null,null,{"$f":"IF(AF38<>\"\",IF(E38<>\"\",ABS(24*60*(E38-AF38)),ABS(24*60*(G38-AF38))),0)","v":0},{"$f":"COUNTA(AF38,AI38,AK38,AM38)","v":0},null,{"$f":"IF(AI38<>\"\",IF(H38<>\"\",ABS(24*60*(H38-AI38)),ABS(24*60*(F38-AI38))),0)","v":0},null,{"$f":"IF(AK38<>\"\",IF(E38<>\"\",ABS(24*60*(E38-AK38)),ABS(24*60*(G38-AK38))),0)","v":0},null,{"$f":"IF(AM38<>\"\",IF(H38<>\"\",ABS(24*60*(H38-AM38)),ABS(24*60*(F38-AM38))),0)","v":0},null,null,{"$f":"AQ37+R38-S38","v":0}]
[null,null,"2020-05-26","2020-05-26",null,null,null,null,{"$f":"IF(LEN(F39)+LEN(H39)>0,IF(LEN(H39)>0,(HOUR(F39-E39)+MINUTE(F39-E39)/60)+(HOUR(H39-G39)+MINUTE(H39-G39)/60),(HOUR(F39-E39)+MINUTE(F39-E39)/60)),IF(Parameter!$F$29=1,J39,IF(T39=\"\",0,J39)))","v":0},null,null,null,null,null,null,null,null,{"$f":"IF(I39>J39,I39-J39,0)","v":0},{"$f":"IF(C39<=TODAY(),IF(I39<J39,J39-I39,0),0)","v":0},null,"B",null,null,null,null,null,null,null,null,null,null,null,{"$f":"IF(AF39<>\"\",IF(E39<>\"\",ABS(24*60*(E39-AF39)),ABS(24*60*(G39-AF39))),0)","v":0},{"$f":"COUNTA(AF39,AI39,AK39,AM39)","v":0},null,{"$f":"IF(AI39<>\"\",IF(H39<>\"\",ABS(24*60*(H39-AI39)),ABS(24*60*(F39-AI39))),0)","v":0},null,{"$f":"IF(AK39<>\"\",IF(E39<>\"\",ABS(24*60*(E39-AK39)),ABS(24*60*(G39-AK39))),0)","v":0},null,{"$f":"IF(AM39<>\"\",IF(H39<>\"\",ABS(24*60*(H39-AM39)),ABS(24*60*(F39-AM39))),0)","v":0},null,null,{"$f":"AQ38+R39-S39","v":0}]
[null,null,"2020-05-27","2020-05-27",null,null,null,null,{"$f":"IF(LEN(F40)+LEN(H40)>0,IF(LEN(H40)>0,(HOUR(F40-E40)+MINUTE(F40-E40)/60)+(HOUR(H40-G40)+MINUTE(H40-G40)/60),(HOUR(F40-E40)+MINUTE(F40-E40)/60)),IF(Parameter!$F$29=1,J40,IF(T40=\"\",0,J40)))","v":0},null,null,null,null,null,null,null,null,{"$f":"IF(I40>J40,I40-J40,0)","v":0},{"$f":"IF(C40<=TODAY(),IF(I40<J40,J40-I40,0),0)","v":0},null,null,null,null,null,null,null,null,null,null,null,null,null,{"$f":"IF(AF40<>\"\",IF(E40<>\"\",ABS(24*60*(E40-AF40)),ABS(24*60*(G40-AF40))),0)","v":0},{"$f":"COUNTA(AF40,AI40,AK40,AM40)","v":0},null,{"$f":"IF(AI40<>\"\",IF(H40<>\"\",ABS(24*60*(H40-AI40)),ABS(24*60*(F40-AI40))),0)","v":0},null,{"$f":"IF(AK40<>\"\",IF(E40<>\"\",ABS(24*60*(E40-AK40)),ABS(24*60*(G40-AK40))),0)","v":0},null,{"$f":"IF(AM40<>\"\",IF(H40<>\"\",ABS(24*60*(H40-AM40)),ABS(24*60*(F40-AM40))),0)","v":0},null,null,{"$f":"AQ39+R40-S40","v":0}]
[null,null,"2020-05-28","2020-05-28",null,null,null,null,{"$f":"IF(LEN(F41)+LEN(H41)>0,IF(LEN(H41)>0,(HOUR(F41-E41)+MINUTE(F41-E41)/60)+(HOUR(H41-G41)+MINUTE(H41-G41)/60),(HOUR(F41-E41)+MINUTE(F41-E41)/60)),IF(Parameter!$F$29=1,J41,IF(T41=\"\",0,J41)))","v":0},null,null,null,null,null,null,null,null,{"$f":"IF(I41>J41,I41-J41,0)","v":0},{"$f":"IF(C41<=TODAY(),IF(I41<J41,J41-I41,0),0)","v":0},null,null,null,null,null,null,null,null,null,null,null,null,null,{"$f":"IF(AF41<>\"\",IF(E41<>\"\",ABS(24*60*(E41-AF41)),ABS(24*60*(G41-AF41))),0)","v":0},{"$f":"COUNTA(AF41,AI41,AK41,AM41)","v":0},null,{"$f":"IF(AI41<>\"\",IF(H41<>\"\",ABS(24*60*(H41-AI41)),ABS(24*60*(F41-AI41))),0)","v":0},null,{"$f":"IF(AK41<>\"\",IF(E41<>\"\",ABS(24*60*(E41-AK41)),ABS(24*60*(G41-AK41))),0)","v":0},null,{"$f":"IF(AM41<>\"\",IF(H41<>\"\",ABS(24*60*(H41-AM41)),ABS(24*60*(F41-AM41))),0)","v":0},null,null,{"$f":"AQ40+R41-S41","v":0}]
[null,null,"2020-05-29","2020-05-29",null,null,null,null,{"$f":"IF(LEN(F42)+LEN(H42)>0,IF(LEN(H42)>0,(HOUR(F42-E42)+MINUTE(F42-E42)/60)+(HOUR(H42-G42)+MINUTE(H42-G42)/60),(HOUR(F42-E42)+MINUTE(F42-E42)/60)),IF(Parameter!$F$29=1,J42,IF(T42=\"\",0,J42)))","v":0},null,null,null,null,null,null,null,null,{"$f":"IF(I42>J42,I42-J42,0)","v":0},{"$f":"IF(C42<=TODAY(),IF(I42<J42,J42-I42,0),0)","v":0},null,null,null,null,null,null,null,null,null,null,null,null,null,{"$f":"IF(AF42<>\"\",IF(E42<>\"\",ABS(24*60*(E42-AF42)),ABS(24*60*(G42-AF42))),0)","v":0},{"$f":"COUNTA(AF42,AI42,AK42,AM42)","v":0},null,{"$f":"IF(AI42<>\"\",IF(H42<>\"\",ABS(24*60*(H42-AI42)),ABS(24*60*(F42-AI42))),0)","v":0},null,{"$f":"IF(AK42<>\"\",IF(E42<>\"\",ABS(24*60*(E42-AK42)),ABS(24*60*(G42-AK42))),0)","v":0},null,{"$f":"IF(AM42<>\"\",IF(H42<>\"\",ABS(24*60*(H42-AM42)),ABS(24*60*(F42-AM42))),0)","v":0},null,null,{"$f":"AQ41+R42-S42","v":0}]
[null,null,{"$f":"IF(MONTH(C14)<>2,IF(MONTH(C42+1)>MONTH(C42),\"\",C42+1),\"\")","v":"2020-05-30"},"2020-05-30",null,null,null,null,{"$f":"IF(LEN(F43)+LEN(H43)>0,IF(LEN(H43)>0,(HOUR(F43-E43)+MINUTE(F43-E43)/60)+(HOUR(H43-G43)+MINUTE(H43-G43)/60),(HOUR(F43-E43)+MINUTE(F43-E43)/60)),IF(Parameter!$F$29=1,J43,IF(T43=\"\",0,J43)))","v":0},null,null,null,null,null,null,null,null,{"$f":"IF(I43>J43,I43-J43,0)","v":0},{"$f":"IF(C43<=TODAY(),IF(I43<J43,J43-I43,0),0)","v":0},null,null,null,null,null,null,null,null,null,null,null,null,null,{"$f":"IF(AF43<>\"\",IF(E43<>\"\",ABS(24*60*(E43-AF43)),ABS(24*60*(G43-AF43))),0)","v":0},{"$f":"COUNTA(AF43,AI43,AK43,AM43)","v":0},null,{"$f":"IF(AI43<>\"\",IF(H43<>\"\",ABS(24*60*(H43-AI43)),ABS(24*60*(F43-AI43))),0)","v":0},null,{"$f":"IF(AK43<>\"\",IF(E43<>\"\",ABS(24*60*(E43-AK43)),ABS(24*60*(G43-AK43))),0)","v":0},null,{"$f":"IF(AM43<>\"\",IF(H43<>\"\",ABS(24*60*(H43-AM43)),ABS(24*60*(F43-AM43))),0)","v":0},null,null,{"$f":"AQ42+R43-S43","v":0}]
[null,null,{"$f":"IF(MONTH(C14)<>2,IF(MONTH(C43+1)>MONTH(C43),\"\",C43+1),\"\")","v":"2020-05-31"},"2020-05-31",null,null,null,null,{"$f":"IF(LEN(F44)+LEN(H44)>0,IF(LEN(H44)>0,(HOUR(F44-E44)+MINUTE(F44-E44)/60)+(HOUR(H44-G44)+MINUTE(H44-G44)/60),(HOUR(F44-E44)+MINUTE(F44-E44)/60)),IF(Parameter!$F$29=1,J44,IF(T44=\"\",0,J44)))","v":0},null,null,null,null,null,null,null,null,{"$f":"IF(I44>J44,I44-J44,0)","v":0},{"$f":"IF(C44<=TODAY(),IF(I44<J44,J44-I44,0),0)","v":0},null,null,null,null,null,null,null,null,null,null,null,null,null,{"$f":"IF(AF44<>\"\",IF(E44<>\"\",ABS(24*60*(E44-AF44)),ABS(24*60*(G44-AF44))),0)","v":0},{"$f":"COUNTA(AF44,AI44,AK44,AM44)","v":0},null,{"$f":"IF(AI44<>\"\",IF(H44<>\"\",ABS(24*60*(H44-AI44)),ABS(24*60*(F44-AI44))),0)","v":0},null,{"$f":"IF(AK44<>\"\",IF(E44<>\"\",ABS(24*60*(E44-AK44)),ABS(24*60*(G44-AK44))),0)","v":0},null,{"$f":"IF(AM44<>\"\",IF(H44<>\"\",ABS(24*60*(H44-AM44)),ABS(24*60*(F44-AM44))),0)","v":0},null,null,{"$f":"AQ43+R44-S44","v":0}]
[null,null,null,null,null,null,null,"Summe:",{"$f":"ROUND(SUM(I14:I44),2)","v":0},{"$f":"ROUND(SUM(J13:J44),2)","v":0},{"$f":"SUM(K14:K44)","v":0},0,0,0,0,0,0,{"$f":"ROUND(SUM(R14:R44),2)","v":0},{"$f":"ROUND(SUM(S14:S44),2)","v":0},{"$f":"IF(COUNTA(T14:T44)=0,\"\",\"/U:\" & COUNTIF(T14:T44,\"u\")&\"/K:\" & COUNTIF(T14:T44,\"k\")&\"/Rest:\" & COUNTA(T14:T44)-COUNTIF(T14:T44,\"u\")-COUNTIF(T14:T44,\"k\"))","v":""},null,null,"Kontrollsummen:",null,null,null,null,null,null,null,null,null,null,null,null,null,null,null,null,null,null,null,null,{"$f":"SUM(AR14:AR44)","v":0},0,0,0,null,0,0,null,"Durchschnitt"]
[null,null,null,null,null,null,null,null,null,null,null,null,null,null,null,null,null,{"$f":"ROUND(R45-S45,2)","v":0},null,"Monatssaldo",null,null,{"$f":"\"IST-Stunden \"&ISTsumme&\" - SOLL-Stunden \"&SOLLsumme&\" =\"","v":"IST-Stunden 0 - SOLL-Stunden 0 ="},null,null,{"$f":"ISTsumme-SOLLsumme","v":0},null,null,null,null,null,null,null,null,null,null,null,null,null,null,null,null,null,null,null,null,null,null,null,null,null,{"$f":"IFERROR(SUM(AZ14:AZ44)/COUNTA(AZ14:AZ44),\"\")","v":""}]
[null,null,"Über-/Mehrstunden",null,null,{"$f":"ROUND(AT45+AU45,2)","v":0},"korr.Endsaldo inkl.Vorperiode:",null,null,null,null,null,null,null,null,null,null,{"$f":"ROUND(R9+R46,2)+F48","v":0},null,"Endsaldo inkl.Vorperiode",null,null,{"$f":"IF(M45<>0,\"minus automatische Überstunden:\",\"Monatssaldo (Zelle R46):\")","v":"Monatssaldo (Zelle R46):"},null,null,{"$f":"IF(M45<>0,-M45,R46)","v":0}]
[null,null,"Zeitsaldo Korrektur",null,null,{"$f":"ROUND((AS45-AT45),2)","v":0},null,null,null,null,null,null,null,null,null,null,null,null,null,"Auszahlung Gutstunden",null,null,{"$f":"IF(M45<>0,\"=Monatssaldo (Zelle R46):\",\"Differenz =\")","v":"Differenz ="},null,null,{"$f":"IF(M45<>0,(Z46+Z47),ROUND(Z46-Z47,1))","v":0}]
[null,null,"Info Lohn: ",null,null,null,null,null,null,null,null,null,null,null,null,null,null,{"$f":"R47-R48","v":0},null,"Vortrag abzgl.Auszahlg.",null,null,{"$f":"IF(M45<>0,\"Differenz =\",\"\")","v":""},null,null,{"$f":"IF(M45<>0,ROUND(Z48-R46,1),\"\")","v":""}]

{"sheet":"6 JUN","index":8,"n_rows":49,"n_cols":75,"rows_kept":49,"cut":false,"hidden":false,"merged":[[47,14,47,16],[47,17,47,18],[10,50,12,50],[10,44,12,44],[10,45,12,45],[10,46,12,46],[10,47,12,47],[10,48,12,48],[10,49,12,49],[10,14,12,14],[10,15,12,15],[10,16,12,16],[46,6,46,16],[10,10,12,10],[10,42,12,42],[10,12,12,12],[2,2,2,18],[6,26,7,26],[5,22,5,24],[10,51,12,51],[10,43,12,43],[7,16,8,16],[8,17,8,18],[8,4,8,8],[7,14,8,14],[7,15,8,15],[7,10,8,10],[7,11,8,11],[7,12,8,12],[7,13,8,13],[2,30,2,32],[2,34,2,35],[11,34,11,35],[0,22,0,26],[5,27,6,27],[8,26,9,26],[11,23,11,24],[11,25,11,26],[10,22,10,26],[11,22,12,22],[10,13,12,13],[10,19,12,19],[5,2,5,4],[7,2,7,3],[10,3,11,3],[11,6,11,7],[10,8,11,9],[8,2,8,3],[11,4,11,5],[10,4,10,7],[10,2,11,2],[5,5,5,8],[5,17,7,18],[7,4,7,8],[5,10,5,13],[45,8,45,9],[46,19,46,21],[5,16,6,16],[48,2,48,3],[48,4,48,9],[47,10,47,13],[46,2,46,4],[47,2,47,4],[47,6,47,9],[46,17,46,18],[10,11,12,11],[44,19,44,20],[45,17,45,18],[10,20,12,20],[11,17,11,18],[45,19,45,21],[48,22,48,24],[45,22,45,24],[46,22,46,24],[48,17,48,18],[47,19,47,21],[48,19,48,21],[47,22,47,24],[2,73,11,73],[2,74,11,74],[11,37,11,38],[2,69,11,69],[2,70,11,70],[2,71,11,71],[2,72,11,72],[2,37,2,38]]}
[]
[]
[null,null,null,null,null,null,null,null,null,null,null,null,null,null,null,null,null,null,null,null,null,null,null,null,null,null,null,null,null,null,null,null,null,null,null,null,null,null,null,null,null,null,null,null,null,null,null,null,null,null,null,null,null,null,null,null,null,null,null,null,null,null,null,null,null,null,null,null,null,{"$f":"IF(AND(Parameter!B69<>\"\"),Parameter!B69&\" \"&Parameter!E69&\"%\",\"\")","v":"Zuschlag vor DP-Beginn 25%"},{"$f":"IF(AND(Parameter!E70<>\"\",Parameter!F70<>\"\"),Parameter!B70&\" \"&TEXT(Parameter!F70,\"hh:mm\")&\" \"&Parameter!E70&\"%\",\"\")","v":"Zuschlag innerhalb DP \nnach 1.Uhrzeit 19:30 50%"},{"$f":"Parameter!B71&\" \"&TEXT(Parameter!F71,\"hh:mm\")&\" \"&Parameter!E71&\"%\"","v":"Zuschlag innerhalb DP \nnach 2.Uhrzeit 21:00 75%"},{"$f":"Parameter!B72&\" \"&TEXT(Parameter!F72,\"hh:mm\")&\" \"&Parameter!E72&\"%\"","v":"Zuschlag außerhalb DP \nnach 1.Uhrzeit 19:30 100%"},{"$f":"Parameter!B73&\" \"&TEXT(Parameter!F73,\"hh:mm\")&\" \"&Parameter!E73&\"%\"","v":"Zuschlag außerhalb DP \nnach 2.Uhrzeit 21:00 125%"},{"$f":"IF(AND(Parameter!B74<>\"\"),Parameter!B74&\" \"&Parameter!E74&\"%\",\"\")","v":"Zuschlag nach DP-Ende 150%"}]
[]
[]
[null,null,"Monat",null,null,{"$f":"MonatsErster+152","v":"2020-06-01"},null,null,null,null,"täglich",null,null,null,"So/Feier","Woche",{"$f":"IF(LEFT(Parameter!J62,1)=\"1\",\"Manuell\",\"Morgen Zeit\")","v":"Manuell"},"Vortrag\nVormonat"]
[]
[null,null,"MitarbeitNr.",null,{"$f":"IF('1 JAN'!E8<>\"\",'1 JAN'!E8,\"\")","v":""},null,null,null,null,null,{"$f":"Parameter!Q50","v":">21:00   100% Üh   "},{"$f":"Parameter!Q52","v":">19:30   50% Üh   "},{"$f":"Parameter!Q54","v":">9h                 50% Üh   "},{"$f":"Parameter!Q56","v":"> Soll-h bis 9 Std.                    50% Üh   "},{"$f":"Parameter!Q58","v":"So/Feiert 100% Üh   "},{"$f":"Parameter!Q60","v":">39h      100% Üh   "},{"$f":"Parameter!Q62","v":"manuell    50% Mh   "}]
[null,null,"Name:",null,{"$f":"IF('1 JAN'!E9<>\"\",'1 JAN'!E9,\"\")","v":""},null,null,null,null,null,null,null,null,null,null,null,null,{"$f":"IF(Parameter!F34=TRUE,'5 MAI'!R49:S49,0)","v":0}]
[null,null,null,{"$f":"IF(D16=\"Fr\",\"JA\",\"\")","v":""}]
[null,null,"Datum","Tag","tatsächliche Arbeitszeit",null,null,null," Gesamt\nStunden",null,{"$f":"MID(Parameter!F50,3,99)","v":"Grund-Stunde ZA - Zuschlag auszahlen"},{"$f":"MID(Parameter!F52,3,99)","v":"Grund-Stunde ZA - Zuschlag auszahlen"},{"$f":"MID(Parameter!F54,3,99)","v":"Grund-Stunde ZA - Zuschlag auszahlen"},{"$f":"MID(Parameter!F56,3,99)","v":"Grund-Stunde ZA - Zuschlag auszahlen"},{"$f":"MID(Parameter!F58,3,99)","v":"Grund-Stunde ZA - Zuschlag auszahlen"},{"$f":"MID(Parameter!F60,3,99)","v":"Grund-Stunde ZA - Zuschlag auszahlen"},{"$f":"MID(Parameter!F62,3,99)","v":"Grund-Stunde ZA - Zuschlag auszahlen"},"Gut-","Minus-"," Urlaub\nKrank\n\nU oder K \nmachen","Feiertag\n\nF-ix\nB-ewegl.",null,{"$f":"IF(AND(UPPER(Parameter!G68=\"AKTIV\"),UPPER(Parameter!R69=\"AKTIV\")),\"Dienstplan-Vorschlag übernehmen\",IF(UPPER(Parameter!G68=\"AKTIV\"),\"Dienstplan\",\"Manuelle Zeiterfassung\"))","v":"Manuelle Zeiterfassung"},null,null,null,null,null,null,null,null,null,null,null,null,null,null,null,null,null,null,null,"Aktueller\nTages\nSaldo","Summe Grundstunden\nim Zeitsaldo","Summe \nZuschlag \nZeitsaldo \nerhöhend","Summe Grundstunden\nzur Auszahlung","Summe \nZuschlag\nzur Auszahlung","Korrigierter Tagessaldo","Korrigierte \nTages IST-Std","Differenz SOLL-Std zu IST-Std inkl. Zeitsaldo Korrekturen","Tagesstunden + sonntags Summe Wochen-\nStunden","Wochen\nsumme \n(korrigiert)"]
[null,null,null,null,"Vormittag",null,"Nachmittag",null,null,null,null,null,null,null,null,null,null,"Stunden",null,null,null,null,{"$f":"IF(UPPER(Parameter!G68)=\"AKTIV\",\"Manuelle Zeiten in Spalte W sind monatlich manuell in die Spalten E-H zu übernehmen\",\"Begründung manuelle Zeiterfassung\")","v":"Begründung manuelle Zeiterfassung"},"Vormittag",null,"Nachmittag"]
[null,"OK",null,null,"von","bis","von","bis","Ist","Soll",null,null,null,null,null,null,null,"+","-",null,null,null,null,"von","bis","von","bis",null,null,null,"Anmerkung","Internet AN Vorm.","Differenz","Anzahl Internetzeiten","Internet AB Vorm","Differenz","Internet AN Nachm.","Differenz","Internet AB Nachm.","Differenz",null,null,null,null,null,null,null,null,null,null,null,null,null,null,null,null,null,null,null,null,null,null,null,null,null,null,null,null,null,{"$f":"SUM(BR14:BR44)","v":0},0,0,0,0,0]
[null,null,{"$f":"DATE('1 JAN'!G2,6,1)","v":"2020-06-01"},{"$f":"C14","v":"2020-06-01"},null,null,null,null,{"$f":"IF(LEN(F14)+LEN(H14)>0,IF(LEN(H14)>0,(HOUR(F14-E14)+MINUTE(F14-E14)/60)+(HOUR(H14-G14)+MINUTE(H14-G14)/60),(HOUR(F14-E14)+MINUTE(F14-E14)/60)),IF(Parameter!$F$29=1,J14,IF(T14=\"\",0,J14)))","v":0},null,null,null,null,null,null,null,null,{"$f":"IF(I14>J14,I14-J14,0)","v":0},{"$f":"IF(C14<=TODAY(),IF(I14<J14,J14-I14,0),0)","v":0},null,null,null,null,null,null,null,null,null,null,null,null,null,{"$f":"IF(AF14<>\"\",IF(E14<>\"\",ABS(24*60*(E14-AF14)),ABS(24*60*(G14-AF14))),0)","v":0},{"$f":"COUNTA(AF14,AI14,AK14,AM14)","v":0},null,{"$f":"IF(AI14<>\"\",IF(H14<>\"\",ABS(24*60*(H14-AI14)),ABS(24*60*(F14-AI14))),0)","v":0},null,{"$f":"IF(AK14<>\"\",IF(E14<>\"\",ABS(24*60*(E14-AK14)),ABS(24*60*(G14-AK14))),0)","v":0},null,{"$f":"IF(AM14<>\"\",IF(H14<>\"\",ABS(24*60*(H14-AM14)),ABS(24*60*(F14-AM14))),0)","v":0},null,null,{"$f":"R9+R14-S14","v":0}]
[null,null,{"$f":"IF(MONTH(C14+1)>MONTH(C14),\"\",C14+1)","v":"2020-06-02"},"2020-06-02",null,null,null,null,{"$f":"IF(LEN(F15)+LEN(H15)>0,IF(LEN(H15)>0,(HOUR(F15-E15)+MINUTE(F15-E15)/60)+(HOUR(H15-G15)+MINUTE(H15-G15)/60),(HOUR(F15-E15)+MINUTE(F15-E15)/60)),IF(Parameter!$F$29=1,J15,IF(T15=\"\",0,J15)))","v":0},null,null,null,null,null,null,null,null,{"$f":"IF(I15>J15,I15-J15,0)","v":0},{"$f":"IF(C15<=TODAY(),IF(I15<J15,J15-I15,0),0)","v":0},null,null,null,null,null,null,null,null,null,null,null,null,null,{"$f":"IF(AF15<>\"\",IF(E15<>\"\",ABS(24*60*(E15-AF15)),ABS(24*60*(G15-AF15))),0)","v":0},{"$f":"COUNTA(AF15,AI15,AK15,AM15)","v":0},null,{"$f":"IF(AI15<>\"\",IF(H15<>\"\",ABS(24*60*(H15-AI15)),ABS(24*60*(F15-AI15))),0)","v":0},null,{"$f":"IF(AK15<>\"\",IF(E15<>\"\",ABS(24*60*(E15-AK15)),ABS(24*60*(G15-AK15))),0)","v":0},null,{"$f":"IF(AM15<>\"\",IF(H15<>\"\",ABS(24*60*(H15-AM15)),ABS(24*60*(F15-AM15))),0)","v":0},null,null,{"$f":"AQ14+R15-S15","v":0}]
[null,null,"2020-06-03","2020-06-03",null,null,null,null,{"$f":"IF(LEN(F16)+LEN(H16)>0,IF(LEN(H16)>0,(HOUR(F16-E16)+MINUTE(F16-E16)/60)+(HOUR(H16-G16)+MINUTE(H16-G16)/60),(HOUR(F16-E16)+MINUTE(F16-E16)/60)),IF(Parameter!$F$29=1,J16,IF(T16=\"\",0,J16)))","v":0},null,null,null,null,null,null,null,null,{"$f":"IF(I16>J16,I16-J16,0)","v":0},{"$f":"IF(C16<=TODAY(),IF(I16<J16,J16-I16,0),0)","v":0},null,null,null,null,null,null,null,null,null,null,null,null,null,{"$f":"IF(AF16<>\"\",IF(E16<>\"\",ABS(24*60*(E16-AF16)),ABS(24*60*(G16-AF16))),0)","v":0},{"$f":"COUNTA(AF16,AI16,AK16,AM16)","v":0},null,{"$f":"IF(AI16<>\"\",IF(H16<>\"\",ABS(24*60*(H16-AI16)),ABS(24*60*(F16-AI16))),0)","v":0},null,{"$f":"IF(AK16<>\"\",IF(E16<>\"\",ABS(24*60*(E16-AK16)),ABS(24*60*(G16-AK16))),0)","v":0},null,{"$f":"IF(AM16<>\"\",IF(H16<>\"\",ABS(24*60*(H16-AM16)),ABS(24*60*(F16-AM16))),0)","v":0},null,null,{"$f":"AQ15+R16-S16","v":0}]
[null,null,"2020-06-04","2020-06-04",null,null,null,null,{"$f":"IF(LEN(F17)+LEN(H17)>0,IF(LEN(H17)>0,(HOUR(F17-E17)+MINUTE(F17-E17)/60)+(HOUR(H17-G17)+MINUTE(H17-G17)/60),(HOUR(F17-E17)+MINUTE(F17-E17)/60)),IF(Parameter!$F$29=1,J17,IF(T17=\"\",0,J17)))","v":0},null,null,null,null,null,null,null,null,{"$f":"IF(I17>J17,I17-J17,0)","v":0},{"$f":"IF(C17<=TODAY(),IF(I17<J17,J17-I17,0),0)","v":0},null,null,null,null,null,null,null,null,null,null,null,null,null,{"$f":"IF(AF17<>\"\",IF(E17<>\"\",ABS(24*60*(E17-AF17)),ABS(24*60*(G17-AF17))),0)","v":0},{"$f":"COUNTA(AF17,AI17,AK17,AM17)","v":0},null,{"$f":"IF(AI17<>\"\",IF(H17<>\"\",ABS(24*60*(H17-AI17)),ABS(24*60*(F17-AI17))),0)","v":0},null,{"$f":"IF(AK17<>\"\",IF(E17<>\"\",ABS(24*60*(E17-AK17)),ABS(24*60*(G17-AK17))),0)","v":0},null,{"$f":"IF(AM17<>\"\",IF(H17<>\"\",ABS(24*60*(H17-AM17)),ABS(24*60*(F17-AM17))),0)","v":0},null,null,{"$f":"AQ16+R17-S17","v":0}]
[null,null,"2020-06-05","2020-06-05",null,null,null,null,{"$f":"IF(LEN(F18)+LEN(H18)>0,IF(LEN(H18)>0,(HOUR(F18-E18)+MINUTE(F18-E18)/60)+(HOUR(H18-G18)+MINUTE(H18-G18)/60),(HOUR(F18-E18)+MINUTE(F18-E18)/60)),IF(Parameter!$F$29=1,J18,IF(T18=\"\",0,J18)))","v":0},null,null,null,null,null,null,null,null,{"$f":"IF(I18>J18,I18-J18,0)","v":0},{"$f":"IF(C18<=TODAY(),IF(I18<J18,J18-I18,0),0)","v":0},null,null,null,null,null,null,null,null,null,null,null,null,null,{"$f":"IF(AF18<>\"\",IF(E18<>\"\",ABS(24*60*(E18-AF18)),ABS(24*60*(G18-AF18))),0)","v":0},{"$f":"COUNTA(AF18,AI18,AK18,AM18)","v":0},null,{"$f":"IF(AI18<>\"\",IF(H18<>\"\",ABS(24*60*(H18-AI18)),ABS(24*60*(F18-AI18))),0)","v":0},null,{"$f":"IF(AK18<>\"\",IF(E18<>\"\",ABS(24*60*(E18-AK18)),ABS(24*60*(G18-AK18))),0)","v":0},null,{"$f":"IF(AM18<>\"\",IF(H18<>\"\",ABS(24*60*(H18-AM18)),ABS(24*60*(F18-AM18))),0)","v":0},null,null,{"$f":"AQ17+R18-S18","v":0}]
[null,null,"2020-06-06","2020-06-06",null,null,null,null,{"$f":"IF(LEN(F19)+LEN(H19)>0,IF(LEN(H19)>0,(HOUR(F19-E19)+MINUTE(F19-E19)/60)+(HOUR(H19-G19)+MINUTE(H19-G19)/60),(HOUR(F19-E19)+MINUTE(F19-E19)/60)),IF(Parameter!$F$29=1,J19,IF(T19=\"\",0,J19)))","v":0},null,null,null,null,null,null,null,null,{"$f":"IF(I19>J19,I19-J19,0)","v":0},{"$f":"IF(C19<=TODAY(),IF(I19<J19,J19-I19,0),0)","v":0},null,"B",null,null,null,null,null,null,null,null,null,null,null,{"$f":"IF(AF19<>\"\",IF(E19<>\"\",ABS(24*60*(E19-AF19)),ABS(24*60*(G19-AF19))),0)","v":0},{"$f":"COUNTA(AF19,AI19,AK19,AM19)","v":0},null,{"$f":"IF(AI19<>\"\",IF(H19<>\"\",ABS(24*60*(H19-AI19)),ABS(24*60*(F19-AI19))),0)","v":0},null,{"$f":"IF(AK19<>\"\",IF(E19<>\"\",ABS(24*60*(E19-AK19)),ABS(24*60*(G19-AK19))),0)","v":0},null,{"$f":"IF(AM19<>\"\",IF(H19<>\"\",ABS(24*60*(H19-AM19)),ABS(24*60*(F19-AM19))),0)","v":0},null,null,{"$f":"AQ18+R19-S19","v":0}]
[null,null,"2020-06-07","2020-06-07",null,null,null,null,{"$f":"IF(LEN(F20)+LEN(H20)>0,IF(LEN(H20)>0,(HOUR(F20-E20)+MINUTE(F20-E20)/60)+(HOUR(H20-G20)+MINUTE(H20-G20)/60),(HOUR(F20-E20)+MINUTE(F20-E20)/60)),IF(Parameter!$F$29=1,J20,IF(T20=\"\",0,J20)))","v":0},null,null,null,null,null,null,null,null,{"$f":"IF(I20>J20,I20-J20,0)","v":0},{"$f":"IF(C20<=TODAY(),IF(I20<J20,J20-I20,0),0)","v":0},null,null,null,null,null,null,null,null,null,null,null,null,null,{"$f":"IF(AF20<>\"\",IF(E20<>\"\",ABS(24*60*(E20-AF20)),ABS(24*60*(G20-AF20))),0)","v":0},{"$f":"COUNTA(AF20,AI20,AK20,AM20)","v":0},null,{"$f":"IF(AI20<>\"\",IF(H20<>\"\",ABS(24*60*(H20-AI20)),ABS(24*60*(F20-AI20))),0)","v":0},null,{"$f":"IF(AK20<>\"\",IF(E20<>\"\",ABS(24*60*(E20-AK20)),ABS(24*60*(G20-AK20))),0)","v":0},null,{"$f":"IF(AM20<>\"\",IF(H20<>\"\",ABS(24*60*(H20-AM20)),ABS(24*60*(F20-AM20))),0)","v":0},null,null,{"$f":"AQ19+R20-S20","v":0}]
[null,null,"2020-06-08","2020-06-08",null,null,null,null,{"$f":"IF(LEN(F21)+LEN(H21)>0,IF(LEN(H21)>0,(HOUR(F21-E21)+MINUTE(F21-E21)/60)+(HOUR(H21-G21)+MINUTE(H21-G21)/60),(HOUR(F21-E21)+MINUTE(F21-E21)/60)),IF(Parameter!$F$29=1,J21,IF(T21=\"\",0,J21)))","v":0},null,null,null,null,null,null,null,null,{"$f":"IF(I21>J21,I21-J21,0)","v":0},{"$f":"IF(C21<=TODAY(),IF(I21<J21,J21-I21,0),0)","v":0},null,null,null,null,null,null,null,null,null,null,null,null,null,{"$f":"IF(AF21<>\"\",IF(E21<>\"\",ABS(24*60*(E21-AF21)),ABS(24*60*(G21-AF21))),0)","v":0},{"$f":"COUNTA(AF21,AI21,AK21,AM21)","v":0},null,{"$f":"IF(AI21<>\"\",IF(H21<>\"\",ABS(24*60*(H21-AI21)),ABS(24*60*(F21-AI21))),0)","v":0},null,{"$f":"IF(AK21<>\"\",IF(E21<>\"\",ABS(24*60*(E21-AK21)),ABS(24*60*(G21-AK21))),0)","v":0},null,{"$f":"IF(AM21<>\"\",IF(H21<>\"\",ABS(24*60*(H21-AM21)),ABS(24*60*(F21-AM21))),0)","v":0},null,null,{"$f":"AQ20+R21-S21","v":0}]
[null,null,"2020-06-09","2020-06-09",null,null,null,null,{"$f":"IF(LEN(F22)+LEN(H22)>0,IF(LEN(H22)>0,(HOUR(F22-E22)+MINUTE(F22-E22)/60)+(HOUR(H22-G22)+MINUTE(H22-G22)/60),(HOUR(F22-E22)+MINUTE(F22-E22)/60)),IF(Parameter!$F$29=1,J22,IF(T22=\"\",0,J22)))","v":0},null,null,null,null,null,null,null,null,{"$f":"IF(I22>J22,I22-J22,0)","v":0},{"$f":"IF(C22<=TODAY(),IF(I22<J22,J22-I22,0),0)","v":0},null,null,null,null,null,null,null,null,null,null,null,null,null,{"$f":"IF(AF22<>\"\",IF(E22<>\"\",ABS(24*60*(E22-AF22)),ABS(24*60*(G22-AF22))),0)","v":0},{"$f":"COUNTA(AF22,AI22,AK22,AM22)","v":0},null,{"$f":"IF(AI22<>\"\",IF(H22<>\"\",ABS(24*60*(H22-AI22)),ABS(24*60*(F22-AI22))),0)","v":0},null,{"$f":"IF(AK22<>\"\",IF(E22<>\"\",ABS(24*60*(E22-AK22)),ABS(24*60*(G22-AK22))),0)","v":0},null,{"$f":"IF(AM22<>\"\",IF(H22<>\"\",ABS(24*60*(H22-AM22)),ABS(24*60*(F22-AM22))),0)","v":0},null,null,{"$f":"AQ21+R22-S22","v":0}]
[null,null,"2020-06-10","2020-06-10",null,null,null,null,{"$f":"IF(LEN(F23)+LEN(H23)>0,IF(LEN(H23)>0,(HOUR(F23-E23)+MINUTE(F23-E23)/60)+(HOUR(H23-G23)+MINUTE(H23-G23)/60),(HOUR(F23-E23)+MINUTE(F23-E23)/60)),IF(Parameter!$F$29=1,J23,IF(T23=\"\",0,J23)))","v":0},null,null,null,null,null,null,null,null,{"$f":"IF(I23>J23,I23-J23,0)","v":0},{"$f":"IF(C23<=TODAY(),IF(I23<J23,J23-I23,0),0)","v":0},null,null,null,null,null,null,null,null,null,null,null,null,null,{"$f":"IF(AF23<>\"\",IF(E23<>\"\",ABS(24*60*(E23-AF23)),ABS(24*60*(G23-AF23))),0)","v":0},{"$f":"COUNTA(AF23,AI23,AK23,AM23)","v":0},null,{"$f":"IF(AI23<>\"\",IF(H23<>\"\",ABS(24*60*(H23-AI23)),ABS(24*60*(F23-AI23))),0)","v":0},null,{"$f":"IF(AK23<>\"\",IF(E23<>\"\",ABS(24*60*(E23-AK23)),ABS(24*60*(G23-AK23))),0)","v":0},null,{"$f":"IF(AM23<>\"\",IF(H23<>\"\",ABS(24*60*(H23-AM23)),ABS(24*60*(F23-AM23))),0)","v":0},null,null,{"$f":"AQ22+R23-S23","v":0}]
[null,null,"2020-06-11","2020-06-11",null,null,null,null,{"$f":"IF(LEN(F24)+LEN(H24)>0,IF(LEN(H24)>0,(HOUR(F24-E24)+MINUTE(F24-E24)/60)+(HOUR(H24-G24)+MINUTE(H24-G24)/60),(HOUR(F24-E24)+MINUTE(F24-E24)/60)),IF(Parameter!$F$29=1,J24,IF(T24=\"\",0,J24)))","v":0},null,null,null,null,null,null,null,null,{"$f":"IF(I24>J24,I24-J24,0)","v":0},{"$f":"IF(C24<=TODAY(),IF(I24<J24,J24-I24,0),0)","v":0},null,null,null,null,null,null,null,null,null,null,null,null,null,{"$f":"IF(AF24<>\"\",IF(E24<>\"\",ABS(24*60*(E24-AF24)),ABS(24*60*(G24-AF24))),0)","v":0},{"$f":"COUNTA(AF24,AI24,AK24,AM24)","v":0},null,{"$f":"IF(AI24<>\"\",IF(H24<>\"\",ABS(24*60*(H24-AI24)),ABS(24*60*(F24-AI24))),0)","v":0},null,{"$f":"IF(AK24<>\"\",IF(E24<>\"\",ABS(24*60*(E24-AK24)),ABS(24*60*(G24-AK24))),0)","v":0},null,{"$f":"IF(AM24<>\"\",IF(H24<>\"\",ABS(24*60*(H24-AM24)),ABS(24*60*(F24-AM24))),0)","v":0},null,null,{"$f":"AQ23+R24-S24","v":0}]
[null,null,"2020-06-12","2020-06-12",null,null,null,null,{"$f":"IF(LEN(F25)+LEN(H25)>0,IF(LEN(H25)>0,(HOUR(F25-E25)+MINUTE(F25-E25)/60)+(HOUR(H25-G25)+MINUTE(H25-G25)/60),(HOUR(F25-E25)+MINUTE(F25-E25)/60)),IF(Parameter!$F$29=1,J25,IF(T25=\"\",0,J25)))","v":0},null,null,null,null,null,null,null,null,{"$f":"IF(I25>J25,I25-J25,0)","v":0},{"$f":"IF(C25<=TODAY(),IF(I25<J25,J25-I25,0),0)","v":0},null,null,null,null,null,null,null,null,null,null,null,null,null,{"$f":"IF(AF25<>\"\",IF(E25<>\"\",ABS(24*60*(E25-AF25)),ABS(24*60*(G25-AF25))),0)","v":0},{"$f":"COUNTA(AF25,AI25,AK25,AM25)","v":0},null,{"$f":"IF(AI25<>\"\",IF(H25<>\"\",ABS(24*60*(H25-AI25)),ABS(24*60*(F25-AI25))),0)","v":0},null,{"$f":"IF(AK25<>\"\",IF(E25<>\"\",ABS(24*60*(E25-AK25)),ABS(24*60*(G25-AK25))),0)","v":0},null,{"$f":"IF(AM25<>\"\",IF(H25<>\"\",ABS(24*60*(H25-AM25)),ABS(24*60*(F25-AM25))),0)","v":0},null,null,{"$f":"AQ24+R25-S25","v":0}]
[null,null,"2020-06-13","2020-06-13",null,null,null,null,{"$f":"IF(LEN(F26)+LEN(H26)>0,IF(LEN(H26)>0,(HOUR(F26-E26)+MINUTE(F26-E26)/60)+(HOUR(H26-G26)+MINUTE(H26-G26)/60),(HOUR(F26-E26)+MINUTE(F26-E26)/60)),IF(Parameter!$F$29=1,J26,IF(T26=\"\",0,J26)))","v":0},null,null,null,null,null,null,null,null,{"$f":"IF(I26>J26,I26-J26,0)","v":0},{"$f":"IF(C26<=TODAY(),IF(I26<J26,J26-I26,0),0)","v":0},null,null,null,null,null,null,null,null,null,null,null,null,null,{"$f":"IF(AF26<>\"\",IF(E26<>\"\",ABS(24*60*(E26-AF26)),ABS(24*60*(G26-AF26))),0)","v":0},{"$f":"COUNTA(AF26,AI26,AK26,AM26)","v":0},null,{"$f":"IF(AI26<>\"\",IF(H26<>\"\",ABS(24*60*(H26-AI26)),ABS(24*60*(F26-AI26))),0)","v":0},null,{"$f":"IF(AK26<>\"\",IF(E26<>\"\",ABS(24*60*(E26-AK26)),ABS(24*60*(G26-AK26))),0)","v":0},null,{"$f":"IF(AM26<>\"\",IF(H26<>\"\",ABS(24*60*(H26-AM26)),ABS(24*60*(F26-AM26))),0)","v":0},null,null,{"$f":"AQ25+R26-S26","v":0}]
[null,null,"2020-06-14","2020-06-14",null,null,null,null,{"$f":"IF(LEN(F27)+LEN(H27)>0,IF(LEN(H27)>0,(HOUR(F27-E27)+MINUTE(F27-E27)/60)+(HOUR(H27-G27)+MINUTE(H27-G27)/60),(HOUR(F27-E27)+MINUTE(F27-E27)/60)),IF(Parameter!$F$29=1,J27,IF(T27=\"\",0,J27)))","v":0},null,null,null,null,null,null,null,null,{"$f":"IF(I27>J27,I27-J27,0)","v":0},{"$f":"IF(C27<=TODAY(),IF(I27<J27,J27-I27,0),0)","v":0},null,null,null,null,null,null,null,null,null,null,null,null,null,{"$f":"IF(AF27<>\"\",IF(E27<>\"\",ABS(24*60*(E27-AF27)),ABS(24*60*(G27-AF27))),0)","v":0},{"$f":"COUNTA(AF27,AI27,AK27,AM27)","v":0},null,{"$f":"IF(AI27<>\"\",IF(H27<>\"\",ABS(24*60*(H27-AI27)),ABS(24*60*(F27-AI27))),0)","v":0},null,{"$f":"IF(AK27<>\"\",IF(E27<>\"\",ABS(24*60*(E27-AK27)),ABS(24*60*(G27-AK27))),0)","v":0},null,{"$f":"IF(AM27<>\"\",IF(H27<>\"\",ABS(24*60*(H27-AM27)),ABS(24*60*(F27-AM27))),0)","v":0},null,null,{"$f":"AQ26+R27-S27","v":0}]
[null,null,"2020-06-15","2020-06-15",null,null,null,null,{"$f":"IF(LEN(F28)+LEN(H28)>0,IF(LEN(H28)>0,(HOUR(F28-E28)+MINUTE(F28-E28)/60)+(HOUR(H28-G28)+MINUTE(H28-G28)/60),(HOUR(F28-E28)+MINUTE(F28-E28)/60)),IF(Parameter!$F$29=1,J28,IF(T28=\"\",0,J28)))","v":0},null,null,null,null,null,null,null,null,{"$f":"IF(I28>J28,I28-J28,0)","v":0},{"$f":"IF(C28<=TODAY(),IF(I28<J28,J28-I28,0),0)","v":0},null,null,null,null,null,null,null,null,null,null,null,null,null,{"$f":"IF(AF28<>\"\",IF(E28<>\"\",ABS(24*60*(E28-AF28)),ABS(24*60*(G28-AF28))),0)","v":0},{"$f":"COUNTA(AF28,AI28,AK28,AM28)","v":0},null,{"$f":"IF(AI28<>\"\",IF(H28<>\"\",ABS(24*60*(H28-AI28)),ABS(24*60*(F28-AI28))),0)","v":0},null,{"$f":"IF(AK28<>\"\",IF(E28<>\"\",ABS(24*60*(E28-AK28)),ABS(24*60*(G28-AK28))),0)","v":0},null,{"$f":"IF(AM28<>\"\",IF(H28<>\"\",ABS(24*60*(H28-AM28)),ABS(24*60*(F28-AM28))),0)","v":0},null,null,{"$f":"AQ27+R28-S28","v":0}]
[null,null,"2020-06-16","2020-06-16",null,null,null,null,{"$f":"IF(LEN(F29)+LEN(H29)>0,IF(LEN(H29)>0,(HOUR(F29-E29)+MINUTE(F29-E29)/60)+(HOUR(H29-G29)+MINUTE(H29-G29)/60),(HOUR(F29-E29)+MINUTE(F29-E29)/60)),IF(Parameter!$F$29=1,J29,IF(T29=\"\",0,J29)))","v":0},null,null,null,null,null,null,null,null,{"$f":"IF(I29>J29,I29-J29,0)","v":0},{"$f":"IF(C29<=TODAY(),IF(I29<J29,J29-I29,0),0)","v":0},null,"B",null,null,null,null,null,null,null,null,null,null,null,{"$f":"IF(AF29<>\"\",IF(E29<>\"\",ABS(24*60*(E29-AF29)),ABS(24*60*(G29-AF29))),0)","v":0},{"$f":"COUNTA(AF29,AI29,AK29,AM29)","v":0},null,{"$f":"IF(AI29<>\"\",IF(H29<>\"\",ABS(24*60*(H29-AI29)),ABS(24*60*(F29-AI29))),0)","v":0},null,{"$f":"IF(AK29<>\"\",IF(E29<>\"\",ABS(24*60*(E29-AK29)),ABS(24*60*(G29-AK29))),0)","v":0},null,{"$f":"IF(AM29<>\"\",IF(H29<>\"\",ABS(24*60*(H29-AM29)),ABS(24*60*(F29-AM29))),0)","v":0},null,null,{"$f":"AQ28+R29-S29","v":0}]
[null,null,"2020-06-17","2020-06-17",null,null,null,null,{"$f":"IF(LEN(F30)+LEN(H30)>0,IF(LEN(H30)>0,(HOUR(F30-E30)+MINUTE(F30-E30)/60)+(HOUR(H30-G30)+MINUTE(H30-G30)/60),(HOUR(F30-E30)+MINUTE(F30-E30)/60)),IF(Parameter!$F$29=1,J30,IF(T30=\"\",0,J30)))","v":0},null,null,null,null,null,null,null,null,{"$f":"IF(I30>J30,I30-J30,0)","v":0},{"$f":"IF(C30<=TODAY(),IF(I30<J30,J30-I30,0),0)","v":0},null,null,null,null,null,null,null,null,null,null,null,null,null,{"$f":"IF(AF30<>\"\",IF(E30<>\"\",ABS(24*60*(E30-AF30)),ABS(24*60*(G30-AF30))),0)","v":0},{"$f":"COUNTA(AF30,AI30,AK30,AM30)","v":0},null,{"$f":"IF(AI30<>\"\",IF(H30<>\"\",ABS(24*60*(H30-AI30)),ABS(24*60*(F30-AI30))),0)","v":0},null,{"$f":"IF(AK30<>\"\",IF(E30<>\"\",ABS(24*60*(E30-AK30)),ABS(24*60*(G30-AK30))),0)","v":0},null,{"$f":"IF(AM30<>\"\",IF(H30<>\"\",ABS(24*60*(H30-AM30)),ABS(24*60*(F30-AM30))),0)","v":0},null,null,{"$f":"AQ29+R30-S30","v":0}]
[null,null,"2020-06-18","2020-06-18",null,null,null,null,{"$f":"IF(LEN(F31)+LEN(H31)>0,IF(LEN(H31)>0,(HOUR(F31-E31)+MINUTE(F31-E31)/60)+(HOUR(H31-G31)+MINUTE(H31-G31)/60),(HOUR(F31-E31)+MINUTE(F31-E31)/60)),IF(Parameter!$F$29=1,J31,IF(T31=\"\",0,J31)))","v":0},null,null,null,null,null,null,null,null,{"$f":"IF(I31>J31,I31-J31,0)","v":0},{"$f":"IF(C31<=TODAY(),IF(I31<J31,J31-I31,0),0)","v":0},null,null,null,null,null,null,null,null,null,null,null,null,null,{"$f":"IF(AF31<>\"\",IF(E31<>\"\",ABS(24*60*(E31-AF31)),ABS(24*60*(G31-AF31))),0)","v":0},{"$f":"COUNTA(AF31,AI31,AK31,AM31)","v":0},null,{"$f":"IF(AI31<>\"\",IF(H31<>\"\",ABS(24*60*(H31-AI31)),ABS(24*60*(F31-AI31))),0)","v":0},null,{"$f":"IF(AK31<>\"\",IF(E31<>\"\",ABS(24*60*(E31-AK31)),ABS(24*60*(G31-AK31))),0)","v":0},null,{"$f":"IF(AM31<>\"\",IF(H31<>\"\",ABS(24*60*(H31-AM31)),ABS(24*60*(F31-AM31))),0)","v":0},null,null,{"$f":"AQ30+R31-S31","v":0}]
[null,null,"2020-06-19","2020-06-19",null,null,null,null,{"$f":"IF(LEN(F32)+LEN(H32)>0,IF(LEN(H32)>0,(HOUR(F32-E32)+MINUTE(F32-E32)/60)+(HOUR(H32-G32)+MINUTE(H32-G32)/60),(HOUR(F32-E32)+MINUTE(F32-E32)/60)),IF(Parameter!$F$29=1,J32,IF(T32=\"\",0,J32)))","v":0},null,null,null,null,null,null,null,null,{"$f":"IF(I32>J32,I32-J32,0)","v":0},{"$f":"IF(C32<=TODAY(),IF(I32<J32,J32-I32,0),0)","v":0},null,null,null,null,null,null,null,null,null,null,null,null,null,{"$f":"IF(AF32<>\"\",IF(E32<>\"\",ABS(24*60*(E32-AF32)),ABS(24*60*(G32-AF32))),0)","v":0},{"$f":"COUNTA(AF32,AI32,AK32,AM32)","v":0},null,{"$f":"IF(AI32<>\"\",IF(H32<>\"\",ABS(24*60*(H32-AI32)),ABS(24*60*(F32-AI32))),0)","v":0},null,{"$f":"IF(AK32<>\"\",IF(E32<>\"\",ABS(24*60*(E32-AK32)),ABS(24*60*(G32-AK32))),0)","v":0},null,{"$f":"IF(AM32<>\"\",IF(H32<>\"\",ABS(24*60*(H32-AM32)),ABS(24*60*(F32-AM32))),0)","v":0},null,null,{"$f":"AQ31+R32-S32","v":0}]
[null,null,"2020-06-20","2020-06-20",null,null,null,null,{"$f":"IF(LEN(F33)+LEN(H33)>0,IF(LEN(H33)>0,(HOUR(F33-E33)+MINUTE(F33-E33)/60)+(HOUR(H33-G33)+MINUTE(H33-G33)/60),(HOUR(F33-E33)+MINUTE(F33-E33)/60)),IF(Parameter!$F$29=1,J33,IF(T33=\"\",0,J33)))","v":0},null,null,null,null,null,null,null,null,{"$f":"IF(I33>J33,I33-J33,0)","v":0},{"$f":"IF(C33<=TODAY(),IF(I33<J33,J33-I33,0),0)","v":0},null,null,null,null,null,null,null,null,null,null,null,null,null,{"$f":"IF(AF33<>\"\",IF(E33<>\"\",ABS(24*60*(E33-AF33)),ABS(24*60*(G33-AF33))),0)","v":0},{"$f":"COUNTA(AF33,AI33,AK33,AM33)","v":0},null,{"$f":"IF(AI33<>\"\",IF(H33<>\"\",ABS(24*60*(H33-AI33)),ABS(24*60*(F33-AI33))),0)","v":0},null,{"$f":"IF(AK33<>\"\",IF(E33<>\"\",ABS(24*60*(E33-AK33)),ABS(24*60*(G33-AK33))),0)","v":0},null,{"$f":"IF(AM33<>\"\",IF(H33<>\"\",ABS(24*60*(H33-AM33)),ABS(24*60*(F33-AM33))),0)","v":0},null,null,{"$f":"AQ32+R33-S33","v":0}]
[null,null,"2020-06-21","2020-06-21",null,null,null,null,{"$f":"IF(LEN(F34)+LEN(H34)>0,IF(LEN(H34)>0,(HOUR(F34-E34)+MINUTE(F34-E34)/60)+(HOUR(H34-G34)+MINUTE(H34-G34)/60),(HOUR(F34-E34)+MINUTE(F34-E34)/60)),IF(Parameter!$F$29=1,J34,IF(T34=\"\",0,J34)))","v":0},null,null,null,null,null,null,null,null,{"$f":"IF(I34>J34,I34-J34,0)","v":0},{"$f":"IF(C34<=TODAY(),IF(I34<J34,J34-I34,0),0)","v":0},null,null,null,null,null,null,null,null,null,null,null,null,null,{"$f":"IF(AF34<>\"\",IF(E34<>\"\",ABS(24*60*(E34-AF34)),ABS(24*60*(G34-AF34))),0)","v":0},{"$f":"COUNTA(AF34,AI34,AK34,AM34)","v":0},null,{"$f":"IF(AI34<>\"\",IF(H34<>\"\",ABS(24*60*(H34-AI34)),ABS(24*60*(F34-AI34))),0)","v":0},null,{"$f":"IF(AK34<>\"\",IF(E34<>\"\",ABS(24*60*(E34-AK34)),ABS(24*60*(G34-AK34))),0)","v":0},null,{"$f":"IF(AM34<>\"\",IF(H34<>\"\",ABS(24*60*(H34-AM34)),ABS(24*60*(F34-AM34))),0)","v":0},null,null,{"$f":"AQ33+R34-S34","v":0}]
[null,null,"2020-06-22","2020-06-22",null,null,null,null,{"$f":"IF(LEN(F35)+LEN(H35)>0,IF(LEN(H35)>0,(HOUR(F35-E35)+MINUTE(F35-E35)/60)+(HOUR(H35-G35)+MINUTE(H35-G35)/60),(HOUR(F35-E35)+MINUTE(F35-E35)/60)),IF(Parameter!$F$29=1,J35,IF(T35=\"\",0,J35)))","v":0},null,null,null,null,null,null,null,null,{"$f":"IF(I35>J35,I35-J35,0)","v":0},{"$f":"IF(C35<=TODAY(),IF(I35<J35,J35-I35,0),0)","v":0},null,null,null,null,null,null,null,null,null,null,null,null,null,{"$f":"IF(AF35<>\"\",IF(E35<>\"\",ABS(24*60*(E35-AF35)),ABS(24*60*(G35-AF35))),0)","v":0},{"$f":"COUNTA(AF35,AI35,AK35,AM35)","v":0},null,{"$f":"IF(AI35<>\"\",IF(H35<>\"\",ABS(24*60*(H35-AI35)),ABS(24*60*(F35-AI35))),0)","v":0},null,{"$f":"IF(AK35<>\"\",IF(E35<>\"\",ABS(24*60*(E35-AK35)),ABS(24*60*(G35-AK35))),0)","v":0},null,{"$f":"IF(AM35<>\"\",IF(H35<>\"\",ABS(24*60*(H35-AM35)),ABS(24*60*(F35-AM35))),0)","v":0},null,null,{"$f":"AQ34+R35-S35","v":0}]
[null,null,"2020-06-23","2020-06-23",null,null,null,null,{"$f":"IF(LEN(F36)+LEN(H36)>0,IF(LEN(H36)>0,(HOUR(F36-E36)+MINUTE(F36-E36)/60)+(HOUR(H36-G36)+MINUTE(H36-G36)/60),(HOUR(F36-E36)+MINUTE(F36-E36)/60)),IF(Parameter!$F$29=1,J36,IF(T36=\"\",0,J36)))","v":0},null,null,null,null,null,null,null,null,{"$f":"IF(I36>J36,I36-J36,0)","v":0},{"$f":"IF(C36<=TODAY(),IF(I36<J36,J36-I36,0),0)","v":0},null,null,null,null,null,null,null,null,null,null,null,null,null,{"$f":"IF(AF36<>\"\",IF(E36<>\"\",ABS(24*60*(E36-AF36)),ABS(24*60*(G36-AF36))),0)","v":0},{"$f":"COUNTA(AF36,AI36,AK36,AM36)","v":0},null,{"$f":"IF(AI36<>\"\",IF(H36<>\"\",ABS(24*60*(H36-AI36)),ABS(24*60*(F36-AI36))),0)","v":0},null,{"$f":"IF(AK36<>\"\",IF(E36<>\"\",ABS(24*60*(E36-AK36)),ABS(24*60*(G36-AK36))),0)","v":0},null,{"$f":"IF(AM36<>\"\",IF(H36<>\"\",ABS(24*60*(H36-AM36)),ABS(24*60*(F36-AM36))),0)","v":0},null,null,{"$f":"AQ35+R36-S36","v":0}]
[null,null,"2020-06-24","2020-06-24",null,null,null,null,{"$f":"IF(LEN(F37)+LEN(H37)>0,IF(LEN(H37)>0,(HOUR(F37-E37)+MINUTE(F37-E37)/60)+(HOUR(H37-G37)+MINUTE(H37-G37)/60),(HOUR(F37-E37)+MINUTE(F37-E37)/60)),IF(Parameter!$F$29=1,J37,IF(T37=\"\",0,J37)))","v":0},null,null,null,null,null,null,null,null,{"$f":"IF(I37>J37,I37-J37,0)","v":0},{"$f":"IF(C37<=TODAY(),IF(I37<J37,J37-I37,0),0)","v":0},null,null,null,null,null,null,null,null,null,null,null,null,null,{"$f":"IF(AF37<>\"\",IF(E37<>\"\",ABS(24*60*(E37-AF37)),ABS(24*60*(G37-AF37))),0)","v":0},{"$f":"COUNTA(AF37,AI37,AK37,AM37)","v":0},null,{"$f":"IF(AI37<>\"\",IF(H37<>\"\",ABS(24*60*(H37-AI37)),ABS(24*60*(F37-AI37))),0)","v":0},null,{"$f":"IF(AK37<>\"\",IF(E37<>\"\",ABS(24*60*(E37-AK37)),ABS(24*60*(G37-AK37))),0)","v":0},null,{"$f":"IF(AM37<>\"\",IF(H37<>\"\",ABS(24*60*(H37-AM37)),ABS(24*60*(F37-AM37))),0)","v":0},null,null,{"$f":"AQ36+R37-S37","v":0}]
[null,null,"2020-06-25","2020-06-25",null,null,null,null,{"$f":"IF(LEN(F38)+LEN(H38)>0,IF(LEN(H38)>0,(HOUR(F38-E38)+MINUTE(F38-E38)/60)+(HOUR(H38-G38)+MINUTE(H38-G38)/60),(HOUR(F38-E38)+MINUTE(F38-E38)/60)),IF(Parameter!$F$29=1,J38,IF(T38=\"\",0,J38)))","v":0},null,null,null,null,null,null,null,null,{"$f":"IF(I38>J38,I38-J38,0)","v":0},{"$f":"IF(C38<=TODAY(),IF(I38<J38,J38-I38,0),0)","v":0},null,null,null,null,null,null,null,null,null,null,null,null,null,{"$f":"IF(AF38<>\"\",IF(E38<>\"\",ABS(24*60*(E38-AF38)),ABS(24*60*(G38-AF38))),0)","v":0},{"$f":"COUNTA(AF38,AI38,AK38,AM38)","v":0},null,{"$f":"IF(AI38<>\"\",IF(H38<>\"\",ABS(24*60*(H38-AI38)),ABS(24*60*(F38-AI38))),0)","v":0},null,{"$f":"IF(AK38<>\"\",IF(E38<>\"\",ABS(24*60*(E38-AK38)),ABS(24*60*(G38-AK38))),0)","v":0},null,{"$f":"IF(AM38<>\"\",IF(H38<>\"\",ABS(24*60*(H38-AM38)),ABS(24*60*(F38-AM38))),0)","v":0},null,null,{"$f":"AQ37+R38-S38","v":0}]
[null,null,"2020-06-26","2020-06-26",null,null,null,null,{"$f":"IF(LEN(F39)+LEN(H39)>0,IF(LEN(H39)>0,(HOUR(F39-E39)+MINUTE(F39-E39)/60)+(HOUR(H39-G39)+MINUTE(H39-G39)/60),(HOUR(F39-E39)+MINUTE(F39-E39)/60)),IF(Parameter!$F$29=1,J39,IF(T39=\"\",0,J39)))","v":0},null,null,null,null,null,null,null,null,{"$f":"IF(I39>J39,I39-J39,0)","v":0},{"$f":"IF(C39<=TODAY(),IF(I39<J39,J39-I39,0),0)","v":0},null,null,null,null,null,null,null,null,null,null,null,null,null,{"$f":"IF(AF39<>\"\",IF(E39<>\"\",ABS(24*60*(E39-AF39)),ABS(24*60*(G39-AF39))),0)","v":0},{"$f":"COUNTA(AF39,AI39,AK39,AM39)","v":0},null,{"$f":"IF(AI39<>\"\",IF(H39<>\"\",ABS(24*60*(H39-AI39)),ABS(24*60*(F39-AI39))),0)","v":0},null,{"$f":"IF(AK39<>\"\",IF(E39<>\"\",ABS(24*60*(E39-AK39)),ABS(24*60*(G39-AK39))),0)","v":0},null,{"$f":"IF(AM39<>\"\",IF(H39<>\"\",ABS(24*60*(H39-AM39)),ABS(24*60*(F39-AM39))),0)","v":0},null,null,{"$f":"AQ38+R39-S39","v":0}]
[null,null,"2020-06-27","2020-06-27",null,null,null,null,{"$f":"IF(LEN(F40)+LEN(H40)>0,IF(LEN(H40)>0,(HOUR(F40-E40)+MINUTE(F40-E40)/60)+(HOUR(H40-G40)+MINUTE(H40-G40)/60),(HOUR(F40-E40)+MINUTE(F40-E40)/60)),IF(Parameter!$F$29=1,J40,IF(T40=\"\",0,J40)))","v":0},null,null,null,null,null,null,null,null,{"$f":"IF(I40>J40,I40-J40,0)","v":0},{"$f":"IF(C40<=TODAY(),IF(I40<J40,J40-I40,0),0)","v":0},null,null,null,null,null,null,null,null,null,null,null,null,null,{"$f":"IF(AF40<>\"\",IF(E40<>\"\",ABS(24*60*(E40-AF40)),ABS(24*60*(G40-AF40))),0)","v":0},{"$f":"COUNTA(AF40,AI40,AK40,AM40)","v":0},null,{"$f":"IF(AI40<>\"\",IF(H40<>\"\",ABS(24*60*(H40-AI40)),ABS(24*60*(F40-AI40))),0)","v":0},null,{"$f":"IF(AK40<>\"\",IF(E40<>\"\",ABS(24*60*(E40-AK40)),ABS(24*60*(G40-AK40))),0)","v":0},null,{"$f":"IF(AM40<>\"\",IF(H40<>\"\",ABS(24*60*(H40-AM40)),ABS(24*60*(F40-AM40))),0)","v":0},null,null,{"$f":"AQ39+R40-S40","v":0}]
[null,null,"2020-06-28","2020-06-28",null,null,null,null,{"$f":"IF(LEN(F41)+LEN(H41)>0,IF(LEN(H41)>0,(HOUR(F41-E41)+MINUTE(F41-E41)/60)+(HOUR(H41-G41)+MINUTE(H41-G41)/60),(HOUR(F41-E41)+MINUTE(F41-E41)/60)),IF(Parameter!$F$29=1,J41,IF(T41=\"\",0,J41)))","v":0},null,null,null,null,null,null,null,null,{"$f":"IF(I41>J41,I41-J41,0)","v":0},{"$f":"IF(C41<=TODAY(),IF(I41<J41,J41-I41,0),0)","v":0},null,null,null,null,null,null,null,null,null,null,null,null,null,{"$f":"IF(AF41<>\"\",IF(E41<>\"\",ABS(24*60*(E41-AF41)),ABS(24*60*(G41-AF41))),0)","v":0},{"$f":"COUNTA(AF41,AI41,AK41,AM41)","v":0},null,{"$f":"IF(AI41<>\"\",IF(H41<>\"\",ABS(24*60*(H41-AI41)),ABS(24*60*(F41-AI41))),0)","v":0},null,{"$f":"IF(AK41<>\"\",IF(E41<>\"\",ABS(24*60*(E41-AK41)),ABS(24*60*(G41-AK41))),0)","v":0},null,{"$f":"IF(AM41<>\"\",IF(H41<>\"\",ABS(24*60*(H41-AM41)),ABS(24*60*(F41-AM41))),0)","v":0},null,null,{"$f":"AQ40+R41-S41","v":0}]
[null,null,"2020-06-29","2020-06-29",null,null,null,null,{"$f":"IF(LEN(F42)+LEN(H42)>0,IF(LEN(H42)>0,(HOUR(F42-E42)+MINUTE(F42-E42)/60)+(HOUR(H42-G42)+MINUTE(H42-G42)/60),(HOUR(F42-E42)+MINUTE(F42-E42)/60)),IF(Parameter!$F$29=1,J42,IF(T42=\"\",0,J42)))","v":0},null,null,null,null,null,null,null,null,{"$f":"IF(I42>J42,I42-J42,0)","v":0},{"$f":"IF(C42<=TODAY(),IF(I42<J42,J42-I42,0),0)","v":0},null,null,null,null,null,null,null,null,null,null,null,null,null,{"$f":"IF(AF42<>\"\",IF(E42<>\"\",ABS(24*60*(E42-AF42)),ABS(24*60*(G42-AF42))),0)","v":0},{"$f":"COUNTA(AF42,AI42,AK42,AM42)","v":0},null,{"$f":"IF(AI42<>\"\",IF(H42<>\"\",ABS(24*60*(H42-AI42)),ABS(24*60*(F42-AI42))),0)","v":0},null,{"$f":"IF(AK42<>\"\",IF(E42<>\"\",ABS(24*60*(E42-AK42)),ABS(24*60*(G42-AK42))),0)","v":0},null,{"$f":"IF(AM42<>\"\",IF(H42<>\"\",ABS(24*60*(H42-AM42)),ABS(24*60*(F42-AM42))),0)","v":0},null,null,{"$f":"AQ41+R42-S42","v":0}]
[null,null,{"$f":"IF(MONTH(C14)<>2,IF(MONTH(C42+1)>MONTH(C42),\"\",C42+1),\"\")","v":"2020-06-30"},"2020-06-30",null,null,null,null,{"$f":"IF(LEN(F43)+LEN(H43)>0,IF(LEN(H43)>0,(HOUR(F43-E43)+MINUTE(F43-E43)/60)+(HOUR(H43-G43)+MINUTE(H43-G43)/60),(HOUR(F43-E43)+MINUTE(F43-E43)/60)),IF(Parameter!$F$29=1,J43,IF(T43=\"\",0,J43)))","v":0},null,null,null,null,null,null,null,null,{"$f":"IF(I43>J43,I43-J43,0)","v":0},{"$f":"IF(C43<=TODAY(),IF(I43<J43,J43-I43,0),0)","v":0},null,null,null,null,null,null,null,null,null,null,null,null,null,{"$f":"IF(AF43<>\"\",IF(E43<>\"\",ABS(24*60*(E43-AF43)),ABS(24*60*(G43-AF43))),0)","v":0},{"$f":"COUNTA(AF43,AI43,AK43,AM43)","v":0},null,{"$f":"IF(AI43<>\"\",IF(H43<>\"\",ABS(24*60*(H43-AI43)),ABS(24*60*(F43-AI43))),0)","v":0},null,{"$f":"IF(AK43<>\"\",IF(E43<>\"\",ABS(24*60*(E43-AK43)),ABS(24*60*(G43-AK43))),0)","v":0},null,{"$f":"IF(AM43<>\"\",IF(H43<>\"\",ABS(24*60*(H43-AM43)),ABS(24*60*(F43-AM43))),0)","v":0},null,null,{"$f":"AQ42+R43-S43","v":0}]
[null,null,{"$f":"IF(MONTH(C14)<>2,IF(MONTH(C43+1)>MONTH(C43),\"\",C43+1),\"\")","v":""},"",null,null,null,null,{"$f":"IF(LEN(F44)+LEN(H44)>0,IF(LEN(H44)>0,(HOUR(F44-E44)+MINUTE(F44-E44)/60)+(HOUR(H44-G44)+MINUTE(H44-G44)/60),(HOUR(F44-E44)+MINUTE(F44-E44)/60)),IF(Parameter!$F$29=1,J44,IF(T44=\"\",0,J44)))","v":0},null,null,null,null,null,null,null,null,{"$f":"IF(I44>J44,I44-J44,0)","v":0},{"$f":"IF(C44<=TODAY(),IF(I44<J44,J44-I44,0),0)","v":0},null,null,null,null,null,null,null,null,null,null,null,null,null,{"$f":"IF(AF44<>\"\",IF(E44<>\"\",ABS(24*60*(E44-AF44)),ABS(24*60*(G44-AF44))),0)","v":0},{"$f":"COUNTA(AF44,AI44,AK44,AM44)","v":0},null,{"$f":"IF(AI44<>\"\",IF(H44<>\"\",ABS(24*60*(H44-AI44)),ABS(24*60*(F44-AI44))),0)","v":0},null,{"$f":"IF(AK44<>\"\",IF(E44<>\"\",ABS(24*60*(E44-AK44)),ABS(24*60*(G44-AK44))),0)","v":0},null,{"$f":"IF(AM44<>\"\",IF(H44<>\"\",ABS(24*60*(H44-AM44)),ABS(24*60*(F44-AM44))),0)","v":0},null,null,{"$f":"AQ43+R44-S44","v":0}]
[null,null,null,null,null,null,null,"Summe:",{"$f":"ROUND(SUM(I14:I44),2)","v":0},{"$f":"ROUND(SUM(J13:J44),2)","v":0},{"$f":"SUM(K14:K44)","v":0},0,0,0,0,0,0,{"$f":"ROUND(SUM(R14:R44),2)","v":0},{"$f":"ROUND(SUM(S14:S44),2)","v":0},{"$f":"IF(COUNTA(T14:T44)=0,\"\",\"/U:\" & COUNTIF(T14:T44,\"u\")&\"/K:\" & COUNTIF(T14:T44,\"k\")&\"/Rest:\" & COUNTA(T14:T44)-COUNTIF(T14:T44,\"u\")-COUNTIF(T14:T44,\"k\"))","v":""},null,null,"Kontrollsummen:",null,null,null,null,null,null,null,null,null,null,null,null,null,null,null,null,null,null,null,null,{"$f":"SUM(AR14:AR44)","v":0},0,0,0,null,0,0,null,"Durchschnitt"]
[null,null,null,null,null,null,null,null,null,null,null,null,null,null,null,null,null,{"$f":"ROUND(R45-S45,2)","v":0},null,"Monatssaldo",null,null,{"$f":"\"IST-Stunden \"&ISTsumme&\" - SOLL-Stunden \"&SOLLsumme&\" =\"","v":"IST-Stunden 0 - SOLL-Stunden 0 ="},null,null,{"$f":"ISTsumme-SOLLsumme","v":0},null,null,null,null,null,null,null,null,null,null,null,null,null,null,null,null,null,null,null,null,null,null,null,null,null,{"$f":"IFERROR(SUM(AZ14:AZ44)/COUNTA(AZ14:AZ44),\"\")","v":""}]
[null,null,"Über-/Mehrstunden",null,null,{"$f":"ROUND(AT45+AU45,2)","v":0},"korr.Endsaldo inkl.Vorperiode:",null,null,null,null,null,null,null,null,null,null,{"$f":"ROUND(R9+R46,2)+F48","v":0},null,"Endsaldo inkl.Vorperiode",null,null,{"$f":"IF(M45<>0,\"minus automatische Überstunden:\",\"Monatssaldo (Zelle R46):\")","v":"Monatssaldo (Zelle R46):"},null,null,{"$f":"IF(M45<>0,-M45,R46)","v":0}]
[null,null,"Zeitsaldo Korrektur",null,null,{"$f":"ROUND((AS45-AT45),2)","v":0},null,null,null,null,null,null,null,null,null,null,null,null,null,"Auszahlung Gutstunden",null,null,{"$f":"IF(M45<>0,\"=Monatssaldo (Zelle R46):\",\"Differenz =\")","v":"Differenz ="},null,null,{"$f":"IF(M45<>0,(Z46+Z47),ROUND(Z46-Z47,1))","v":0}]
[null,null,"Info Lohn: ",null,null,null,null,null,null,null,null,null,null,null,null,null,null,{"$f":"R47-R48","v":0},null,"Vortrag abzgl.Auszahlg.",null,null,{"$f":"IF(M45<>0,\"Differenz =\",\"\")","v":""},null,null,{"$f":"IF(M45<>0,ROUND(Z48-R46,1),\"\")","v":""}]

{"sheet":"7 JUL","index":9,"n_rows":49,"n_cols":75,"rows_kept":49,"cut":false,"hidden":false,"merged":[[2,30,2,32],[2,34,2,35],[2,37,2,38],[11,34,11,35],[11,37,11,38],[10,51,12,51],[46,2,46,4],[47,2,47,4],[47,6,47,9],[10,49,12,49],[47,14,47,16],[47,17,47,18],[46,17,46,18],[45,17,45,18],[10,14,12,14],[10,11,12,11],[10,43,12,43],[44,19,44,20],[10,42,12,42],[46,6,46,16],[47,10,47,13],[10,2,11,2],[11,4,11,5],[7,16,8,16],[10,10,12,10],[7,12,8,12],[7,14,8,14],[7,15,8,15],[10,50,12,50],[10,44,12,44],[10,45,12,45],[10,46,12,46],[10,47,12,47],[10,48,12,48],[0,22,0,26],[2,2,2,18],[45,8,45,9],[10,19,12,19],[10,3,11,3],[8,17,8,18],[10,20,12,20],[5,5,5,8],[6,26,7,26],[8,2,8,3],[8,4,8,8],[11,6,11,7],[45,22,45,24],[5,10,5,13],[7,10,8,10],[7,13,8,13],[5,27,6,27],[8,26,9,26],[10,22,10,26],[11,23,11,24],[11,25,11,26],[5,22,5,24],[11,22,12,22],[48,22,48,24],[46,22,46,24],[45,19,45,21],[46,19,46,21],[47,19,47,21],[48,19,48,21],[47,22,47,24],[5,16,6,16],[48,2,48,3],[48,4,48,9],[5,17,7,18],[10,12,12,12],[10,13,12,13],[10,15,12,15],[10,16,12,16],[48,17,48,18],[7,4,7,8],[5,2,5,4],[7,2,7,3],[11,17,11,18],[10,8,11,9],[10,4,10,7],[7,11,8,11],[2,74,11,74],[2,69,11,69],[2,70,11,70],[2,71,11,71],[2,72,11,72],[2,73,11,73]]}
[]
[]
[null,null,null,null,null,null,null,null,null,null,null,null,null,null,null,null,null,null,null,null,null,null,null,null,null,null,null,null,null,null,null,null,null,null,null,null,null,null,null,null,null,null,null,null,null,null,null,null,null,null,null,null,null,null,null,null,null,null,null,null,null,null,null,null,null,null,null,null,null,{"$f":"IF(AND(Parameter!B69<>\"\"),Parameter!B69&\" \"&Parameter!E69&\"%\",\"\")","v":"Zuschlag vor DP-Beginn 25%"},{"$f":"IF(AND(Parameter!E70<>\"\",Parameter!F70<>\"\"),Parameter!B70&\" \"&TEXT(Parameter!F70,\"hh:mm\")&\" \"&Parameter!E70&\"%\",\"\")","v":"Zuschlag innerhalb DP \nnach 1.Uhrzeit 19:30 50%"},{"$f":"Parameter!B71&\" \"&TEXT(Parameter!F71,\"hh:mm\")&\" \"&Parameter!E71&\"%\"","v":"Zuschlag innerhalb DP \nnach 2.Uhrzeit 21:00 75%"},{"$f":"Parameter!B72&\" \"&TEXT(Parameter!F72,\"hh:mm\")&\" \"&Parameter!E72&\"%\"","v":"Zuschlag außerhalb DP \nnach 1.Uhrzeit 19:30 100%"},{"$f":"Parameter!B73&\" \"&TEXT(Parameter!F73,\"hh:mm\")&\" \"&Parameter!E73&\"%\"","v":"Zuschlag außerhalb DP \nnach 2.Uhrzeit 21:00 125%"},{"$f":"IF(AND(Parameter!B74<>\"\"),Parameter!B74&\" \"&Parameter!E74&\"%\",\"\")","v":"Zuschlag nach DP-Ende 150%"}]
[]
[]
[null,null,"Monat",null,null,{"$f":"MonatsErster+182","v":"2020-07-01"},null,null,null,null,"täglich",null,null,null,"So/Feier","Woche",{"$f":"IF(LEFT(Parameter!J62,1)=\"1\",\"Manuell\",\"Morgen Zeit\")","v":"Manuell"},"Vortrag\nVormonat"]
[]
[null,null,"MitarbeitNr.",null,{"$f":"IF('1 JAN'!E8<>\"\",'1 JAN'!E8,\"\")","v":""},null,null,null,null,null,{"$f":"Parameter!Q50","v":">21:00   100% Üh   "},{"$f":"Parameter!Q52","v":">19:30   50% Üh   "},{"$f":"Parameter!Q54","v":">9h                 50% Üh   "},{"$f":"Parameter!Q56","v":"> Soll-h bis 9 Std.                    50% Üh   "},{"$f":"Parameter!Q58","v":"So/Feiert 100% Üh   "},{"$f":"Parameter!Q60","v":">39h      100% Üh   "},{"$f":"Parameter!Q62","v":"manuell    50% Mh   "}]
[null,null,"Name:",null,{"$f":"IF('1 JAN'!E9<>\"\",'1 JAN'!E9,\"\")","v":""},null,null,null,null,null,null,null,null,null,null,null,null,{"$f":"IF(Parameter!F34=TRUE,'6 JUN'!R49:S49,0)","v":0}]
[null,null,null,{"$f":"IF(D16=\"Fr\",\"JA\",\"\")","v":""}]
[null,null,"Datum","Tag","tatsächliche Arbeitszeit",null,null,null," Gesamt\nStunden",null,{"$f":"MID(Parameter!F50,3,99)","v":"Grund-Stunde ZA - Zuschlag auszahlen"},{"$f":"MID(Parameter!F52,3,99)","v":"Grund-Stunde ZA - Zuschlag auszahlen"},{"$f":"MID(Parameter!F54,3,99)","v":"Grund-Stunde ZA - Zuschlag auszahlen"},{"$f":"MID(Parameter!F56,3,99)","v":"Grund-Stunde ZA - Zuschlag auszahlen"},{"$f":"MID(Parameter!F58,3,99)","v":"Grund-Stunde ZA - Zuschlag auszahlen"},{"$f":"MID(Parameter!F60,3,99)","v":"Grund-Stunde ZA - Zuschlag auszahlen"},{"$f":"MID(Parameter!F62,3,99)","v":"Grund-Stunde ZA - Zuschlag auszahlen"},"Gut-","Minus-"," Urlaub\nKrank\n\nU oder K \nmachen","Feiertag\n\nF-ix\nB-ewegl.",null,{"$f":"IF(AND(UPPER(Parameter!G68=\"AKTIV\"),UPPER(Parameter!R69=\"AKTIV\")),\"Dienstplan-Vorschlag übernehmen\",IF(UPPER(Parameter!G68=\"AKTIV\"),\"Dienstplan\",\"Manuelle Zeiterfassung\"))","v":"Manuelle Zeiterfassung"},null,null,null,null,null,null,null,null,null,null,null,null,null,null,null,null,null,null,null,"Aktueller\nTages\nSaldo","Summe Grundstunden\nim Zeitsaldo","Summe \nZuschlag \nZeitsaldo \nerhöhend","Summe Grundstunden\nzur Auszahlung","Summe \nZuschlag\nzur Auszahlung","Korrigierter Tagessaldo","Korrigierte \nTages IST-Std","Differenz SOLL-Std zu IST-Std inkl. Zeitsaldo Korrekturen","Tagesstunden + sonntags Summe Wochen-\nStunden","Wochen\nsumme \n(korrigiert)"]
[null,null,null,null,"Vormittag",null,"Nachmittag",null,null,null,null,null,null,null,null,null,null,"Stunden",null,null,null,null,{"$f":"IF(UPPER(Parameter!G68)=\"AKTIV\",\"Manuelle Zeiten in Spalte W sind monatlich manuell in die Spalten E-H zu übernehmen\",\"Begründung manuelle Zeiterfassung\")","v":"Begründung manuelle Zeiterfassung"},"Vormittag",null,"Nachmittag"]
[null,"OK",null,null,"von","bis","von","bis","Ist","Soll",null,null,null,null,null,null,null,"+","-",null,null,null,null,"von","bis","von","bis",null,null,null,"Anmerkung","Internet AN Vorm.","Differenz","Anzahl Internetzeiten","Internet AB Vorm","Differenz","Internet AN Nachm.","Differenz","Internet AB Nachm.","Differenz",null,null,null,null,null,null,null,null,null,null,null,null,null,null,null,null,null,null,null,null,null,null,null,null,null,null,null,null,null,{"$f":"SUM(BR14:BR44)","v":0},0,0,0,0,0]
[null,null,{"$f":"DATE('1 JAN'!G2,7,1)","v":"2020-07-01"},{"$f":"C14","v":"2020-07-01"},null,null,null,null,{"$f":"IF(LEN(F14)+LEN(H14)>0,IF(LEN(H14)>0,(HOUR(F14-E14)+MINUTE(F14-E14)/60)+(HOUR(H14-G14)+MINUTE(H14-G14)/60),(HOUR(F14-E14)+MINUTE(F14-E14)/60)),IF(Parameter!$F$29=1,J14,IF(T14=\"\",0,J14)))","v":0},null,null,null,null,null,null,null,null,{"$f":"IF(I14>J14,I14-J14,0)","v":0},{"$f":"IF(C14<=TODAY(),IF(I14<J14,J14-I14,0),0)","v":0},null,null,null,null,null,null,null,null,null,null,null,null,null,{"$f":"IF(AF14<>\"\",IF(E14<>\"\",ABS(24*60*(E14-AF14)),ABS(24*60*(G14-AF14))),0)","v":0},{"$f":"COUNTA(AF14,AI14,AK14,AM14)","v":0},null,{"$f":"IF(AI14<>\"\",IF(H14<>\"\",ABS(24*60*(H14-AI14)),ABS(24*60*(F14-AI14))),0)","v":0},null,{"$f":"IF(AK14<>\"\",IF(E14<>\"\",ABS(24*60*(E14-AK14)),ABS(24*60*(G14-AK14))),0)","v":0},null,{"$f":"IF(AM14<>\"\",IF(H14<>\"\",ABS(24*60*(H14-AM14)),ABS(24*60*(F14-AM14))),0)","v":0},null,null,{"$f":"R9+R14-S14","v":0}]
[null,null,{"$f":"IF(MONTH(C14+1)>MONTH(C14),\"\",C14+1)","v":"2020-07-02"},"2020-07-02",null,null,null,null,{"$f":"IF(LEN(F15)+LEN(H15)>0,IF(LEN(H15)>0,(HOUR(F15-E15)+MINUTE(F15-E15)/60)+(HOUR(H15-G15)+MINUTE(H15-G15)/60),(HOUR(F15-E15)+MINUTE(F15-E15)/60)),IF(Parameter!$F$29=1,J15,IF(T15=\"\",0,J15)))","v":0},null,null,null,null,null,null,null,null,{"$f":"IF(I15>J15,I15-J15,0)","v":0},{"$f":"IF(C15<=TODAY(),IF(I15<J15,J15-I15,0),0)","v":0},null,null,null,null,null,null,null,null,null,null,null,null,null,{"$f":"IF(AF15<>\"\",IF(E15<>\"\",ABS(24*60*(E15-AF15)),ABS(24*60*(G15-AF15))),0)","v":0},{"$f":"COUNTA(AF15,AI15,AK15,AM15)","v":0},null,{"$f":"IF(AI15<>\"\",IF(H15<>\"\",ABS(24*60*(H15-AI15)),ABS(24*60*(F15-AI15))),0)","v":0},null,{"$f":"IF(AK15<>\"\",IF(E15<>\"\",ABS(24*60*(E15-AK15)),ABS(24*60*(G15-AK15))),0)","v":0},null,{"$f":"IF(AM15<>\"\",IF(H15<>\"\",ABS(24*60*(H15-AM15)),ABS(24*60*(F15-AM15))),0)","v":0},null,null,{"$f":"AQ14+R15-S15","v":0}]
[null,null,"2020-07-03","2020-07-03",null,null,null,null,{"$f":"IF(LEN(F16)+LEN(H16)>0,IF(LEN(H16)>0,(HOUR(F16-E16)+MINUTE(F16-E16)/60)+(HOUR(H16-G16)+MINUTE(H16-G16)/60),(HOUR(F16-E16)+MINUTE(F16-E16)/60)),IF(Parameter!$F$29=1,J16,IF(T16=\"\",0,J16)))","v":0},null,null,null,null,null,null,null,null,{"$f":"IF(I16>J16,I16-J16,0)","v":0},{"$f":"IF(C16<=TODAY(),IF(I16<J16,J16-I16,0),0)","v":0},null,null,null,null,null,null,null,null,null,null,null,null,null,{"$f":"IF(AF16<>\"\",IF(E16<>\"\",ABS(24*60*(E16-AF16)),ABS(24*60*(G16-AF16))),0)","v":0},{"$f":"COUNTA(AF16,AI16,AK16,AM16)","v":0},null,{"$f":"IF(AI16<>\"\",IF(H16<>\"\",ABS(24*60*(H16-AI16)),ABS(24*60*(F16-AI16))),0)","v":0},null,{"$f":"IF(AK16<>\"\",IF(E16<>\"\",ABS(24*60*(E16-AK16)),ABS(24*60*(G16-AK16))),0)","v":0},null,{"$f":"IF(AM16<>\"\",IF(H16<>\"\",ABS(24*60*(H16-AM16)),ABS(24*60*(F16-AM16))),0)","v":0},null,null,{"$f":"AQ15+R16-S16","v":0}]
[null,null,"2020-07-04","2020-07-04",null,null,null,null,{"$f":"IF(LEN(F17)+LEN(H17)>0,IF(LEN(H17)>0,(HOUR(F17-E17)+MINUTE(F17-E17)/60)+(HOUR(H17-G17)+MINUTE(H17-G17)/60),(HOUR(F17-E17)+MINUTE(F17-E17)/60)),IF(Parameter!$F$29=1,J17,IF(T17=\"\",0,J17)))","v":0},null,null,null,null,null,null,null,null,{"$f":"IF(I17>J17,I17-J17,0)","v":0},{"$f":"IF(C17<=TODAY(),IF(I17<J17,J17-I17,0),0)","v":0},null,null,null,null,null,null,null,null,null,null,null,null,null,{"$f":"IF(AF17<>\"\",IF(E17<>\"\",ABS(24*60*(E17-AF17)),ABS(24*60*(G17-AF17))),0)","v":0},{"$f":"COUNTA(AF17,AI17,AK17,AM17)","v":0},null,{"$f":"IF(AI17<>\"\",IF(H17<>\"\",ABS(24*60*(H17-AI17)),ABS(24*60*(F17-AI17))),0)","v":0},null,{"$f":"IF(AK17<>\"\",IF(E17<>\"\",ABS(24*60*(E17-AK17)),ABS(24*60*(G17-AK17))),0)","v":0},null,{"$f":"IF(AM17<>\"\",IF(H17<>\"\",ABS(24*60*(H17-AM17)),ABS(24*60*(F17-AM17))),0)","v":0},null,null,{"$f":"AQ16+R17-S17","v":0}]
[null,null,"2020-07-05","2020-07-05",null,null,null,null,{"$f":"IF(LEN(F18)+LEN(H18)>0,IF(LEN(H18)>0,(HOUR(F18-E18)+MINUTE(F18-E18)/60)+(HOUR(H18-G18)+MINUTE(H18-G18)/60),(HOUR(F18-E18)+MINUTE(F18-E18)/60)),IF(Parameter!$F$29=1,J18,IF(T18=\"\",0,J18)))","v":0},null,null,null,null,null,null,null,null,{"$f":"IF(I18>J18,I18-J18,0)","v":0},{"$f":"IF(C18<=TODAY(),IF(I18<J18,J18-I18,0),0)","v":0},null,null,null,null,null,null,null,null,null,null,null,null,null,{"$f":"IF(AF18<>\"\",IF(E18<>\"\",ABS(24*60*(E18-AF18)),ABS(24*60*(G18-AF18))),0)","v":0},{"$f":"COUNTA(AF18,AI18,AK18,AM18)","v":0},null,{"$f":"IF(AI18<>\"\",IF(H18<>\"\",ABS(24*60*(H18-AI18)),ABS(24*60*(F18-AI18))),0)","v":0},null,{"$f":"IF(AK18<>\"\",IF(E18<>\"\",ABS(24*60*(E18-AK18)),ABS(24*60*(G18-AK18))),0)","v":0},null,{"$f":"IF(AM18<>\"\",IF(H18<>\"\",ABS(24*60*(H18-AM18)),ABS(24*60*(F18-AM18))),0)","v":0},null,null,{"$f":"AQ17+R18-S18","v":0}]
[null,null,"2020-07-06","2020-07-06",null,null,null,null,{"$f":"IF(LEN(F19)+LEN(H19)>0,IF(LEN(H19)>0,(HOUR(F19-E19)+MINUTE(F19-E19)/60)+(HOUR(H19-G19)+MINUTE(H19-G19)/60),(HOUR(F19-E19)+MINUTE(F19-E19)/60)),IF(Parameter!$F$29=1,J19,IF(T19=\"\",0,J19)))","v":0},null,null,null,null,null,null,null,null,{"$f":"IF(I19>J19,I19-J19,0)","v":0},{"$f":"IF(C19<=TODAY(),IF(I19<J19,J19-I19,0),0)","v":0},null,null,null,null,null,null,null,null,null,null,null,null,null,{"$f":"IF(AF19<>\"\",IF(E19<>\"\",ABS(24*60*(E19-AF19)),ABS(24*60*(G19-AF19))),0)","v":0},{"$f":"COUNTA(AF19,AI19,AK19,AM19)","v":0},null,{"$f":"IF(AI19<>\"\",IF(H19<>\"\",ABS(24*60*(H19-AI19)),ABS(24*60*(F19-AI19))),0)","v":0},null,{"$f":"IF(AK19<>\"\",IF(E19<>\"\",ABS(24*60*(E19-AK19)),ABS(24*60*(G19-AK19))),0)","v":0},null,{"$f":"IF(AM19<>\"\",IF(H19<>\"\",ABS(24*60*(H19-AM19)),ABS(24*60*(F19-AM19))),0)","v":0},null,null,{"$f":"AQ18+R19-S19","v":0}]
[null,null,"2020-07-07","2020-07-07",null,null,null,null,{"$f":"IF(LEN(F20)+LEN(H20)>0,IF(LEN(H20)>0,(HOUR(F20-E20)+MINUTE(F20-E20)/60)+(HOUR(H20-G20)+MINUTE(H20-G20)/60),(HOUR(F20-E20)+MINUTE(F20-E20)/60)),IF(Parameter!$F$29=1,J20,IF(T20=\"\",0,J20)))","v":0},null,null,null,null,null,null,null,null,{"$f":"IF(I20>J20,I20-J20,0)","v":0},{"$f":"IF(C20<=TODAY(),IF(I20<J20,J20-I20,0),0)","v":0},null,null,null,null,null,null,null,null,null,null,null,null,null,{"$f":"IF(AF20<>\"\",IF(E20<>\"\",ABS(24*60*(E20-AF20)),ABS(24*60*(G20-AF20))),0)","v":0},{"$f":"COUNTA(AF20,AI20,AK20,AM20)","v":0},null,{"$f":"IF(AI20<>\"\",IF(H20<>\"\",ABS(24*60*(H20-AI20)),ABS(24*60*(F20-AI20))),0)","v":0},null,{"$f":"IF(AK20<>\"\",IF(E20<>\"\",ABS(24*60*(E20-AK20)),ABS(24*60*(G20-AK20))),0)","v":0},null,{"$f":"IF(AM20<>\"\",IF(H20<>\"\",ABS(24*60*(H20-AM20)),ABS(24*60*(F20-AM20))),0)","v":0},null,null,{"$f":"AQ19+R20-S20","v":0}]
[null,null,"2020-07-08","2020-07-08",null,null,null,null,{"$f":"IF(LEN(F21)+LEN(H21)>0,IF(LEN(H21)>0,(HOUR(F21-E21)+MINUTE(F21-E21)/60)+(HOUR(H21-G21)+MINUTE(H21-G21)/60),(HOUR(F21-E21)+MINUTE(F21-E21)/60)),IF(Parameter!$F$29=1,J21,IF(T21=\"\",0,J21)))","v":0},null,null,null,null,null,null,null,null,{"$f":"IF(I21>J21,I21-J21,0)","v":0},{"$f":"IF(C21<=TODAY(),IF(I21<J21,J21-I21,0),0)","v":0},null,null,null,null,null,null,null,null,null,null,null,null,null,{"$f":"IF(AF21<>\"\",IF(E21<>\"\",ABS(24*60*(E21-AF21)),ABS(24*60*(G21-AF21))),0)","v":0},{"$f":"COUNTA(AF21,AI21,AK21,AM21)","v":0},null,{"$f":"IF(AI21<>\"\",IF(H21<>\"\",ABS(24*60*(H21-AI21)),ABS(24*60*(F21-AI21))),0)","v":0},null,{"$f":"IF(AK21<>\"\",IF(E21<>\"\",ABS(24*60*(E21-AK21)),ABS(24*60*(G21-AK21))),0)","v":0},null,{"$f":"IF(AM21<>\"\",IF(H21<>\"\",ABS(24*60*(H21-AM21)),ABS(24*60*(F21-AM21))),0)","v":0},null,null,{"$f":"AQ20+R21-S21","v":0}]
[null,null,"2020-07-09","2020-07-09",null,null,null,null,{"$f":"IF(LEN(F22)+LEN(H22)>0,IF(LEN(H22)>0,(HOUR(F22-E22)+MINUTE(F22-E22)/60)+(HOUR(H22-G22)+MINUTE(H22-G22)/60),(HOUR(F22-E22)+MINUTE(F22-E22)/60)),IF(Parameter!$F$29=1,J22,IF(T22=\"\",0,J22)))","v":0},null,null,null,null,null,null,null,null,{"$f":"IF(I22>J22,I22-J22,0)","v":0},{"$f":"IF(C22<=TODAY(),IF(I22<J22,J22-I22,0),0)","v":0},null,null,null,null,null,null,null,null,null,null,null,null,null,{"$f":"IF(AF22<>\"\",IF(E22<>\"\",ABS(24*60*(E22-AF22)),ABS(24*60*(G22-AF22))),0)","v":0},{"$f":"COUNTA(AF22,AI22,AK22,AM22)","v":0},null,{"$f":"IF(AI22<>\"\",IF(H22<>\"\",ABS(24*60*(H22-AI22)),ABS(24*60*(F22-AI22))),0)","v":0},null,{"$f":"IF(AK22<>\"\",IF(E22<>\"\",ABS(24*60*(E22-AK22)),ABS(24*60*(G22-AK22))),0)","v":0},null,{"$f":"IF(AM22<>\"\",IF(H22<>\"\",ABS(24*60*(H22-AM22)),ABS(24*60*(F22-AM22))),0)","v":0},null,null,{"$f":"AQ21+R22-S22","v":0}]
[null,null,"2020-07-10","2020-07-10",null,null,null,null,{"$f":"IF(LEN(F23)+LEN(H23)>0,IF(LEN(H23)>0,(HOUR(F23-E23)+MINUTE(F23-E23)/60)+(HOUR(H23-G23)+MINUTE(H23-G23)/60),(HOUR(F23-E23)+MINUTE(F23-E23)/60)),IF(Parameter!$F$29=1,J23,IF(T23=\"\",0,J23)))","v":0},null,null,null,null,null,null,null,null,{"$f":"IF(I23>J23,I23-J23,0)","v":0},{"$f":"IF(C23<=TODAY(),IF(I23<J23,J23-I23,0),0)","v":0},null,null,null,null,null,null,null,null,null,null,null,null,null,{"$f":"IF(AF23<>\"\",IF(E23<>\"\",ABS(24*60*(E23-AF23)),ABS(24*60*(G23-AF23))),0)","v":0},{"$f":"COUNTA(AF23,AI23,AK23,AM23)","v":0},null,{"$f":"IF(AI23<>\"\",IF(H23<>\"\",ABS(24*60*(H23-AI23)),ABS(24*60*(F23-AI23))),0)","v":0},null,{"$f":"IF(AK23<>\"\",IF(E23<>\"\",ABS(24*60*(E23-AK23)),ABS(24*60*(G23-AK23))),0)","v":0},null,{"$f":"IF(AM23<>\"\",IF(H23<>\"\",ABS(24*60*(H23-AM23)),ABS(24*60*(F23-AM23))),0)","v":0},null,null,{"$f":"AQ22+R23-S23","v":0}]
[null,null,"2020-07-11","2020-07-11",null,null,null,null,{"$f":"IF(LEN(F24)+LEN(H24)>0,IF(LEN(H24)>0,(HOUR(F24-E24)+MINUTE(F24-E24)/60)+(HOUR(H24-G24)+MINUTE(H24-G24)/60),(HOUR(F24-E24)+MINUTE(F24-E24)/60)),IF(Parameter!$F$29=1,J24,IF(T24=\"\",0,J24)))","v":0},null,null,null,null,null,null,null,null,{"$f":"IF(I24>J24,I24-J24,0)","v":0},{"$f":"IF(C24<=TODAY(),IF(I24<J24,J24-I24,0),0)","v":0},null,null,null,null,null,null,null,null,null,null,null,null,null,{"$f":"IF(AF24<>\"\",IF(E24<>\"\",ABS(24*60*(E24-AF24)),ABS(24*60*(G24-AF24))),0)","v":0},{"$f":"COUNTA(AF24,AI24,AK24,AM24)","v":0},null,{"$f":"IF(AI24<>\"\",IF(H24<>\"\",ABS(24*60*(H24-AI24)),ABS(24*60*(F24-AI24))),0)","v":0},null,{"$f":"IF(AK24<>\"\",IF(E24<>\"\",ABS(24*60*(E24-AK24)),ABS(24*60*(G24-AK24))),0)","v":0},null,{"$f":"IF(AM24<>\"\",IF(H24<>\"\",ABS(24*60*(H24-AM24)),ABS(24*60*(F24-AM24))),0)","v":0},null,null,{"$f":"AQ23+R24-S24","v":0}]
[null,null,"2020-07-12","2020-07-12",null,null,null,null,{"$f":"IF(LEN(F25)+LEN(H25)>0,IF(LEN(H25)>0,(HOUR(F25-E25)+MINUTE(F25-E25)/60)+(HOUR(H25-G25)+MINUTE(H25-G25)/60),(HOUR(F25-E25)+MINUTE(F25-E25)/60)),IF(Parameter!$F$29=1,J25,IF(T25=\"\",0,J25)))","v":0},null,null,null,null,null,null,null,null,{"$f":"IF(I25>J25,I25-J25,0)","v":0},{"$f":"IF(C25<=TODAY(),IF(I25<J25,J25-I25,0),0)","v":0},null,null,null,null,null,null,null,null,null,null,null,null,null,{"$f":"IF(AF25<>\"\",IF(E25<>\"\",ABS(24*60*(E25-AF25)),ABS(24*60*(G25-AF25))),0)","v":0},{"$f":"COUNTA(AF25,AI25,AK25,AM25)","v":0},null,{"$f":"IF(AI25<>\"\",IF(H25<>\"\",ABS(24*60*(H25-AI25)),ABS(24*60*(F25-AI25))),0)","v":0},null,{"$f":"IF(AK25<>\"\",IF(E25<>\"\",ABS(24*60*(E25-AK25)),ABS(24*60*(G25-AK25))),0)","v":0},null,{"$f":"IF(AM25<>\"\",IF(H25<>\"\",ABS(24*60*(H25-AM25)),ABS(24*60*(F25-AM25))),0)","v":0},null,null,{"$f":"AQ24+R25-S25","v":0}]
[null,null,"2020-07-13","2020-07-13",null,null,null,null,{"$f":"IF(LEN(F26)+LEN(H26)>0,IF(LEN(H26)>0,(HOUR(F26-E26)+MINUTE(F26-E26)/60)+(HOUR(H26-G26)+MINUTE(H26-G26)/60),(HOUR(F26-E26)+MINUTE(F26-E26)/60)),IF(Parameter!$F$29=1,J26,IF(T26=\"\",0,J26)))","v":0},null,null,null,null,null,null,null,null,{"$f":"IF(I26>J26,I26-J26,0)","v":0},{"$f":"IF(C26<=TODAY(),IF(I26<J26,J26-I26,0),0)","v":0},null,null,null,null,null,null,null,null,null,null,null,null,null,{"$f":"IF(AF26<>\"\",IF(E26<>\"\",ABS(24*60*(E26-AF26)),ABS(24*60*(G26-AF26))),0)","v":0},{"$f":"COUNTA(AF26,AI26,AK26,AM26)","v":0},null,{"$f":"IF(AI26<>\"\",IF(H26<>\"\",ABS(24*60*(H26-AI26)),ABS(24*60*(F26-AI26))),0)","v":0},null,{"$f":"IF(AK26<>\"\",IF(E26<>\"\",ABS(24*60*(E26-AK26)),ABS(24*60*(G26-AK26))),0)","v":0},null,{"$f":"IF(AM26<>\"\",IF(H26<>\"\",ABS(24*60*(H26-AM26)),ABS(24*60*(F26-AM26))),0)","v":0},null,null,{"$f":"AQ25+R26-S26","v":0}]
[null,null,"2020-07-14","2020-07-14",null,null,null,null,{"$f":"IF(LEN(F27)+LEN(H27)>0,IF(LEN(H27)>0,(HOUR(F27-E27)+MINUTE(F27-E27)/60)+(HOUR(H27-G27)+MINUTE(H27-G27)/60),(HOUR(F27-E27)+MINUTE(F27-E27)/60)),IF(Parameter!$F$29=1,J27,IF(T27=\"\",0,J27)))","v":0},null,null,null,null,null,null,null,null,{"$f":"IF(I27>J27,I27-J27,0)","v":0},{"$f":"IF(C27<=TODAY(),IF(I27<J27,J27-I27,0),0)","v":0},null,null,null,null,null,null,null,null,null,null,null,null,null,{"$f":"IF(AF27<>\"\",IF(E27<>\"\",ABS(24*60*(E27-AF27)),ABS(24*60*(G27-AF27))),0)","v":0},{"$f":"COUNTA(AF27,AI27,AK27,AM27)","v":0},null,{"$f":"IF(AI27<>\"\",IF(H27<>\"\",ABS(24*60*(H27-AI27)),ABS(24*60*(F27-AI27))),0)","v":0},null,{"$f":"IF(AK27<>\"\",IF(E27<>\"\",ABS(24*60*(E27-AK27)),ABS(24*60*(G27-AK27))),0)","v":0},null,{"$f":"IF(AM27<>\"\",IF(H27<>\"\",ABS(24*60*(H27-AM27)),ABS(24*60*(F27-AM27))),0)","v":0},null,null,{"$f":"AQ26+R27-S27","v":0}]
[null,null,"2020-07-15","2020-07-15",null,null,null,null,{"$f":"IF(LEN(F28)+LEN(H28)>0,IF(LEN(H28)>0,(HOUR(F28-E28)+MINUTE(F28-E28)/60)+(HOUR(H28-G28)+MINUTE(H28-G28)/60),(HOUR(F28-E28)+MINUTE(F28-E28)/60)),IF(Parameter!$F$29=1,J28,IF(T28=\"\",0,J28)))","v":0},null,null,null,null,null,null,null,null,{"$f":"IF(I28>J28,I28-J28,0)","v":0},{"$f":"IF(C28<=TODAY(),IF(I28<J28,J28-I28,0),0)","v":0},null,null,null,null,null,null,null,null,null,null,null,null,null,{"$f":"IF(AF28<>\"\",IF(E28<>\"\",ABS(24*60*(E28-AF28)),ABS(24*60*(G28-AF28))),0)","v":0},{"$f":"COUNTA(AF28,AI28,AK28,AM28)","v":0},null,{"$f":"IF(AI28<>\"\",IF(H28<>\"\",ABS(24*60*(H28-AI28)),ABS(24*60*(F28-AI28))),0)","v":0},null,{"$f":"IF(AK28<>\"\",IF(E28<>\"\",ABS(24*60*(E28-AK28)),ABS(24*60*(G28-AK28))),0)","v":0},null,{"$f":"IF(AM28<>\"\",IF(H28<>\"\",ABS(24*60*(H28-AM28)),ABS(24*60*(F28-AM28))),0)","v":0},null,null,{"$f":"AQ27+R28-S28","v":0}]
[null,null,"2020-07-16","2020-07-16",null,null,null,null,{"$f":"IF(LEN(F29)+LEN(H29)>0,IF(LEN(H29)>0,(HOUR(F29-E29)+MINUTE(F29-E29)/60)+(HOUR(H29-G29)+MINUTE(H29-G29)/60),(HOUR(F29-E29)+MINUTE(F29-E29)/60)),IF(Parameter!$F$29=1,J29,IF(T29=\"\",0,J29)))","v":0},null,null,null,null,null,null,null,null,{"$f":"IF(I29>J29,I29-J29,0)","v":0},{"$f":"IF(C29<=TODAY(),IF(I29<J29,J29-I29,0),0)","v":0},null,null,null,null,null,null,null,null,null,null,null,null,null,{"$f":"IF(AF29<>\"\",IF(E29<>\"\",ABS(24*60*(E29-AF29)),ABS(24*60*(G29-AF29))),0)","v":0},{"$f":"COUNTA(AF29,AI29,AK29,AM29)","v":0},null,{"$f":"IF(AI29<>\"\",IF(H29<>\"\",ABS(24*60*(H29-AI29)),ABS(24*60*(F29-AI29))),0)","v":0},null,{"$f":"IF(AK29<>\"\",IF(E29<>\"\",ABS(24*60*(E29-AK29)),ABS(24*60*(G29-AK29))),0)","v":0},null,{"$f":"IF(AM29<>\"\",IF(H29<>\"\",ABS(24*60*(H29-AM29)),ABS(24*60*(F29-AM29))),0)","v":0},null,null,{"$f":"AQ28+R29-S29","v":0}]
[null,null,"2020-07-17","2020-07-17",null,null,null,null,{"$f":"IF(LEN(F30)+LEN(H30)>0,IF(LEN(H30)>0,(HOUR(F30-E30)+MINUTE(F30-E30)/60)+(HOUR(H30-G30)+MINUTE(H30-G30)/60),(HOUR(F30-E30)+MINUTE(F30-E30)/60)),IF(Parameter!$F$29=1,J30,IF(T30=\"\",0,J30)))","v":0},null,null,null,null,null,null,null,null,{"$f":"IF(I30>J30,I30-J30,0)","v":0},{"$f":"IF(C30<=TODAY(),IF(I30<J30,J30-I30,0),0)","v":0},null,null,null,null,null,null,null,null,null,null,null,null,null,{"$f":"IF(AF30<>\"\",IF(E30<>\"\",ABS(24*60*(E30-AF30)),ABS(24*60*(G30-AF30))),0)","v":0},{"$f":"COUNTA(AF30,AI30,AK30,AM30)","v":0},null,{"$f":"IF(AI30<>\"\",IF(H30<>\"\",ABS(24*60*(H30-AI30)),ABS(24*60*(F30-AI30))),0)","v":0},null,{"$f":"IF(AK30<>\"\",IF(E30<>\"\",ABS(24*60*(E30-AK30)),ABS(24*60*(G30-AK30))),0)","v":0},null,{"$f":"IF(AM30<>\"\",IF(H30<>\"\",ABS(24*60*(H30-AM30)),ABS(24*60*(F30-AM30))),0)","v":0},null,null,{"$f":"AQ29+R30-S30","v":0}]
[null,null,"2020-07-18","2020-07-18",null,null,null,null,{"$f":"IF(LEN(F31)+LEN(H31)>0,IF(LEN(H31)>0,(HOUR(F31-E31)+MINUTE(F31-E31)/60)+(HOUR(H31-G31)+MINUTE(H31-G31)/60),(HOUR(F31-E31)+MINUTE(F31-E31)/60)),IF(Parameter!$F$29=1,J31,IF(T31=\"\",0,J31)))","v":0},null,null,null,null,null,null,null,null,{"$f":"IF(I31>J31,I31-J31,0)","v":0},{"$f":"IF(C31<=TODAY(),IF(I31<J31,J31-I31,0),0)","v":0},null,null,null,null,null,null,null,null,null,null,null,null,null,{"$f":"IF(AF31<>\"\",IF(E31<>\"\",ABS(24*60*(E31-AF31)),ABS(24*60*(G31-AF31))),0)","v":0},{"$f":"COUNTA(AF31,AI31,AK31,AM31)","v":0},null,{"$f":"IF(AI31<>\"\",IF(H31<>\"\",ABS(24*60*(H31-AI31)),ABS(24*60*(F31-AI31))),0)","v":0},null,{"$f":"IF(AK31<>\"\",IF(E31<>\"\",ABS(24*60*(E31-AK31)),ABS(24*60*(G31-AK31))),0)","v":0},null,{"$f":"IF(AM31<>\"\",IF(H31<>\"\",ABS(24*60*(H31-AM31)),ABS(24*60*(F31-AM31))),0)","v":0},null,null,{"$f":"AQ30+R31-S31","v":0}]
[null,null,"2020-07-19","2020-07-19",null,null,null,null,{"$f":"IF(LEN(F32)+LEN(H32)>0,IF(LEN(H32)>0,(HOUR(F32-E32)+MINUTE(F32-E32)/60)+(HOUR(H32-G32)+MINUTE(H32-G32)/60),(HOUR(F32-E32)+MINUTE(F32-E32)/60)),IF(Parameter!$F$29=1,J32,IF(T32=\"\",0,J32)))","v":0},null,null,null,null,null,null,null,null,{"$f":"IF(I32>J32,I32-J32,0)","v":0},{"$f":"IF(C32<=TODAY(),IF(I32<J32,J32-I32,0),0)","v":0},null,null,null,null,null,null,null,null,null,null,null,null,null,{"$f":"IF(AF32<>\"\",IF(E32<>\"\",ABS(24*60*(E32-AF32)),ABS(24*60*(G32-AF32))),0)","v":0},{"$f":"COUNTA(AF32,AI32,AK32,AM32)","v":0},null,{"$f":"IF(AI32<>\"\",IF(H32<>\"\",ABS(24*60*(H32-AI32)),ABS(24*60*(F32-AI32))),0)","v":0},null,{"$f":"IF(AK32<>\"\",IF(E32<>\"\",ABS(24*60*(E32-AK32)),ABS(24*60*(G32-AK32))),0)","v":0},null,{"$f":"IF(AM32<>\"\",IF(H32<>\"\",ABS(24*60*(H32-AM32)),ABS(24*60*(F32-AM32))),0)","v":0},null,null,{"$f":"AQ31+R32-S32","v":0}]
[null,null,"2020-07-20","2020-07-20",null,null,null,null,{"$f":"IF(LEN(F33)+LEN(H33)>0,IF(LEN(H33)>0,(HOUR(F33-E33)+MINUTE(F33-E33)/60)+(HOUR(H33-G33)+MINUTE(H33-G33)/60),(HOUR(F33-E33)+MINUTE(F33-E33)/60)),IF(Parameter!$F$29=1,J33,IF(T33=\"\",0,J33)))","v":0},null,null,null,null,null,null,null,null,{"$f":"IF(I33>J33,I33-J33,0)","v":0},{"$f":"IF(C33<=TODAY(),IF(I33<J33,J33-I33,0),0)","v":0},null,null,null,null,null,null,null,null,null,null,null,null,null,{"$f":"IF(AF33<>\"\",IF(E33<>\"\",ABS(24*60*(E33-AF33)),ABS(24*60*(G33-AF33))),0)","v":0},{"$f":"COUNTA(AF33,AI33,AK33,AM33)","v":0},null,{"$f":"IF(AI33<>\"\",IF(H33<>\"\",ABS(24*60*(H33-AI33)),ABS(24*60*(F33-AI33))),0)","v":0},null,{"$f":"IF(AK33<>\"\",IF(E33<>\"\",ABS(24*60*(E33-AK33)),ABS(24*60*(G33-AK33))),0)","v":0},null,{"$f":"IF(AM33<>\"\",IF(H33<>\"\",ABS(24*60*(H33-AM33)),ABS(24*60*(F33-AM33))),0)","v":0},null,null,{"$f":"AQ32+R33-S33","v":0}]
[null,null,"2020-07-21","2020-07-21",null,null,null,null,{"$f":"IF(LEN(F34)+LEN(H34)>0,IF(LEN(H34)>0,(HOUR(F34-E34)+MINUTE(F34-E34)/60)+(HOUR(H34-G34)+MINUTE(H34-G34)/60),(HOUR(F34-E34)+MINUTE(F34-E34)/60)),IF(Parameter!$F$29=1,J34,IF(T34=\"\",0,J34)))","v":0},null,null,null,null,null,null,null,null,{"$f":"IF(I34>J34,I34-J34,0)","v":0},{"$f":"IF(C34<=TODAY(),IF(I34<J34,J34-I34,0),0)","v":0},null,null,null,null,null,null,null,null,null,null,null,null,null,{"$f":"IF(AF34<>\"\",IF(E34<>\"\",ABS(24*60*(E34-AF34)),ABS(24*60*(G34-AF34))),0)","v":0},{"$f":"COUNTA(AF34,AI34,AK34,AM34)","v":0},null,{"$f":"IF(AI34<>\"\",IF(H34<>\"\",ABS(24*60*(H34-AI34)),ABS(24*60*(F34-AI34))),0)","v":0},null,{"$f":"IF(AK34<>\"\",IF(E34<>\"\",ABS(24*60*(E34-AK34)),ABS(24*60*(G34-AK34))),0)","v":0},null,{"$f":"IF(AM34<>\"\",IF(H34<>\"\",ABS(24*60*(H34-AM34)),ABS(24*60*(F34-AM34))),0)","v":0},null,null,{"$f":"AQ33+R34-S34","v":0}]
[null,null,"2020-07-22","2020-07-22",null,null,null,null,{"$f":"IF(LEN(F35)+LEN(H35)>0,IF(LEN(H35)>0,(HOUR(F35-E35)+MINUTE(F35-E35)/60)+(HOUR(H35-G35)+MINUTE(H35-G35)/60),(HOUR(F35-E35)+MINUTE(F35-E35)/60)),IF(Parameter!$F$29=1,J35,IF(T35=\"\",0,J35)))","v":0},null,null,null,null,null,null,null,null,{"$f":"IF(I35>J35,I35-J35,0)","v":0},{"$f":"IF(C35<=TODAY(),IF(I35<J35,J35-I35,0),0)","v":0},null,null,null,null,null,null,null,null,null,null,null,null,null,{"$f":"IF(AF35<>\"\",IF(E35<>\"\",ABS(24*60*(E35-AF35)),ABS(24*60*(G35-AF35))),0)","v":0},{"$f":"COUNTA(AF35,AI35,AK35,AM35)","v":0},null,{"$f":"IF(AI35<>\"\",IF(H35<>\"\",ABS(24*60*(H35-AI35)),ABS(24*60*(F35-AI35))),0)","v":0},null,{"$f":"IF(AK35<>\"\",IF(E35<>\"\",ABS(24*60*(E35-AK35)),ABS(24*60*(G35-AK35))),0)","v":0},null,{"$f":"IF(AM35<>\"\",IF(H35<>\"\",ABS(24*60*(H35-AM35)),ABS(24*60*(F35-AM35))),0)","v":0},null,null,{"$f":"AQ34+R35-S35","v":0}]
[null,null,"2020-07-23","2020-07-23",null,null,null,null,{"$f":"IF(LEN(F36)+LEN(H36)>0,IF(LEN(H36)>0,(HOUR(F36-E36)+MINUTE(F36-E36)/60)+(HOUR(H36-G36)+MINUTE(H36-G36)/60),(HOUR(F36-E36)+MINUTE(F36-E36)/60)),IF(Parameter!$F$29=1,J36,IF(T36=\"\",0,J36)))","v":0},null,null,null,null,null,null,null,null,{"$f":"IF(I36>J36,I36-J36,0)","v":0},{"$f":"IF(C36<=TODAY(),IF(I36<J36,J36-I36,0),0)","v":0},null,null,null,null,null,null,null,null,null,null,null,null,null,{"$f":"IF(AF36<>\"\",IF(E36<>\"\",ABS(24*60*(E36-AF36)),ABS(24*60*(G36-AF36))),0)","v":0},{"$f":"COUNTA(AF36,AI36,AK36,AM36)","v":0},null,{"$f":"IF(AI36<>\"\",IF(H36<>\"\",ABS(24*60*(H36-AI36)),ABS(24*60*(F36-AI36))),0)","v":0},null,{"$f":"IF(AK36<>\"\",IF(E36<>\"\",ABS(24*60*(E36-AK36)),ABS(24*60*(G36-AK36))),0)","v":0},null,{"$f":"IF(AM36<>\"\",IF(H36<>\"\",ABS(24*60*(H36-AM36)),ABS(24*60*(F36-AM36))),0)","v":0},null,null,{"$f":"AQ35+R36-S36","v":0}]
[null,null,"2020-07-24","2020-07-24",null,null,null,null,{"$f":"IF(LEN(F37)+LEN(H37)>0,IF(LEN(H37)>0,(HOUR(F37-E37)+MINUTE(F37-E37)/60)+(HOUR(H37-G37)+MINUTE(H37-G37)/60),(HOUR(F37-E37)+MINUTE(F37-E37)/60)),IF(Parameter!$F$29=1,J37,IF(T37=\"\",0,J37)))","v":0},null,null,null,null,null,null,null,null,{"$f":"IF(I37>J37,I37-J37,0)","v":0},{"$f":"IF(C37<=TODAY(),IF(I37<J37,J37-I37,0),0)","v":0},null,null,null,null,null,null,null,null,null,null,null,null,null,{"$f":"IF(AF37<>\"\",IF(E37<>\"\",ABS(24*60*(E37-AF37)),ABS(24*60*(G37-AF37))),0)","v":0},{"$f":"COUNTA(AF37,AI37,AK37,AM37)","v":0},null,{"$f":"IF(AI37<>\"\",IF(H37<>\"\",ABS(24*60*(H37-AI37)),ABS(24*60*(F37-AI37))),0)","v":0},null,{"$f":"IF(AK37<>\"\",IF(E37<>\"\",ABS(24*60*(E37-AK37)),ABS(24*60*(G37-AK37))),0)","v":0},null,{"$f":"IF(AM37<>\"\",IF(H37<>\"\",ABS(24*60*(H37-AM37)),ABS(24*60*(F37-AM37))),0)","v":0},null,null,{"$f":"AQ36+R37-S37","v":0}]
[null,null,"2020-07-25","2020-07-25",null,null,null,null,{"$f":"IF(LEN(F38)+LEN(H38)>0,IF(LEN(H38)>0,(HOUR(F38-E38)+MINUTE(F38-E38)/60)+(HOUR(H38-G38)+MINUTE(H38-G38)/60),(HOUR(F38-E38)+MINUTE(F38-E38)/60)),IF(Parameter!$F$29=1,J38,IF(T38=\"\",0,J38)))","v":0},null,null,null,null,null,null,null,null,{"$f":"IF(I38>J38,I38-J38,0)","v":0},{"$f":"IF(C38<=TODAY(),IF(I38<J38,J38-I38,0),0)","v":0},null,null,null,null,null,null,null,null,null,null,null,null,null,{"$f":"IF(AF38<>\"\",IF(E38<>\"\",ABS(24*60*(E38-AF38)),ABS(24*60*(G38-AF38))),0)","v":0},{"$f":"COUNTA(AF38,AI38,AK38,AM38)","v":0},null,{"$f":"IF(AI38<>\"\",IF(H38<>\"\",ABS(24*60*(H38-AI38)),ABS(24*60*(F38-AI38))),0)","v":0},null,{"$f":"IF(AK38<>\"\",IF(E38<>\"\",ABS(24*60*(E38-AK38)),ABS(24*60*(G38-AK38))),0)","v":0},null,{"$f":"IF(AM38<>\"\",IF(H38<>\"\",ABS(24*60*(H38-AM38)),ABS(24*60*(F38-AM38))),0)","v":0},null,null,{"$f":"AQ37+R38-S38","v":0}]
[null,null,"2020-07-26","2020-07-26",null,null,null,null,{"$f":"IF(LEN(F39)+LEN(H39)>0,IF(LEN(H39)>0,(HOUR(F39-E39)+MINUTE(F39-E39)/60)+(HOUR(H39-G39)+MINUTE(H39-G39)/60),(HOUR(F39-E39)+MINUTE(F39-E39)/60)),IF(Parameter!$F$29=1,J39,IF(T39=\"\",0,J39)))","v":0},null,null,null,null,null,null,null,null,{"$f":"IF(I39>J39,I39-J39,0)","v":0},{"$f":"IF(C39<=TODAY(),IF(I39<J39,J39-I39,0),0)","v":0},null,null,null,null,null,null,null,null,null,null,null,null,null,{"$f":"IF(AF39<>\"\",IF(E39<>\"\",ABS(24*60*(E39-AF39)),ABS(24*60*(G39-AF39))),0)","v":0},{"$f":"COUNTA(AF39,AI39,AK39,AM39)","v":0},null,{"$f":"IF(AI39<>\"\",IF(H39<>\"\",ABS(24*60*(H39-AI39)),ABS(24*60*(F39-AI39))),0)","v":0},null,{"$f":"IF(AK39<>\"\",IF(E39<>\"\",ABS(24*60*(E39-AK39)),ABS(24*60*(G39-AK39))),0)","v":0},null,{"$f":"IF(AM39<>\"\",IF(H39<>\"\",ABS(24*60*(H39-AM39)),ABS(24*60*(F39-AM39))),0)","v":0},null,null,{"$f":"AQ38+R39-S39","v":0}]
[null,null,"2020-07-27","2020-07-27",null,null,null,null,{"$f":"IF(LEN(F40)+LEN(H40)>0,IF(LEN(H40)>0,(HOUR(F40-E40)+MINUTE(F40-E40)/60)+(HOUR(H40-G40)+MINUTE(H40-G40)/60),(HOUR(F40-E40)+MINUTE(F40-E40)/60)),IF(Parameter!$F$29=1,J40,IF(T40=\"\",0,J40)))","v":0},null,null,null,null,null,null,null,null,{"$f":"IF(I40>J40,I40-J40,0)","v":0},{"$f":"IF(C40<=TODAY(),IF(I40<J40,J40-I40,0),0)","v":0},null,null,null,null,null,null,null,null,null,null,null,null,null,{"$f":"IF(AF40<>\"\",IF(E40<>\"\",ABS(24*60*(E40-AF40)),ABS(24*60*(G40-AF40))),0)","v":0},{"$f":"COUNTA(AF40,AI40,AK40,AM40)","v":0},null,{"$f":"IF(AI40<>\"\",IF(H40<>\"\",ABS(24*60*(H40-AI40)),ABS(24*60*(F40-AI40))),0)","v":0},null,{"$f":"IF(AK40<>\"\",IF(E40<>\"\",ABS(24*60*(E40-AK40)),ABS(24*60*(G40-AK40))),0)","v":0},null,{"$f":"IF(AM40<>\"\",IF(H40<>\"\",ABS(24*60*(H40-AM40)),ABS(24*60*(F40-AM40))),0)","v":0},null,null,{"$f":"AQ39+R40-S40","v":0}]
[null,null,"2020-07-28","2020-07-28",null,null,null,null,{"$f":"IF(LEN(F41)+LEN(H41)>0,IF(LEN(H41)>0,(HOUR(F41-E41)+MINUTE(F41-E41)/60)+(HOUR(H41-G41)+MINUTE(H41-G41)/60),(HOUR(F41-E41)+MINUTE(F41-E41)/60)),IF(Parameter!$F$29=1,J41,IF(T41=\"\",0,J41)))","v":0},null,null,null,null,null,null,null,null,{"$f":"IF(I41>J41,I41-J41,0)","v":0},{"$f":"IF(C41<=TODAY(),IF(I41<J41,J41-I41,0),0)","v":0},null,null,null,null,null,null,null,null,null,null,null,null,null,{"$f":"IF(AF41<>\"\",IF(E41<>\"\",ABS(24*60*(E41-AF41)),ABS(24*60*(G41-AF41))),0)","v":0},{"$f":"COUNTA(AF41,AI41,AK41,AM41)","v":0},null,{"$f":"IF(AI41<>\"\",IF(H41<>\"\",ABS(24*60*(H41-AI41)),ABS(24*60*(F41-AI41))),0)","v":0},null,{"$f":"IF(AK41<>\"\",IF(E41<>\"\",ABS(24*60*(E41-AK41)),ABS(24*60*(G41-AK41))),0)","v":0},null,{"$f":"IF(AM41<>\"\",IF(H41<>\"\",ABS(24*60*(H41-AM41)),ABS(24*60*(F41-AM41))),0)","v":0},null,null,{"$f":"AQ40+R41-S41","v":0}]
[null,null,"2020-07-29","2020-07-29",null,null,null,null,{"$f":"IF(LEN(F42)+LEN(H42)>0,IF(LEN(H42)>0,(HOUR(F42-E42)+MINUTE(F42-E42)/60)+(HOUR(H42-G42)+MINUTE(H42-G42)/60),(HOUR(F42-E42)+MINUTE(F42-E42)/60)),IF(Parameter!$F$29=1,J42,IF(T42=\"\",0,J42)))","v":0},null,null,null,null,null,null,null,null,{"$f":"IF(I42>J42,I42-J42,0)","v":0},{"$f":"IF(C42<=TODAY(),IF(I42<J42,J42-I42,0),0)","v":0},null,null,null,null,null,null,null,null,null,null,null,null,null,{"$f":"IF(AF42<>\"\",IF(E42<>\"\",ABS(24*60*(E42-AF42)),ABS(24*60*(G42-AF42))),0)","v":0},{"$f":"COUNTA(AF42,AI42,AK42,AM42)","v":0},null,{"$f":"IF(AI42<>\"\",IF(H42<>\"\",ABS(24*60*(H42-AI42)),ABS(24*60*(F42-AI42))),0)","v":0},null,{"$f":"IF(AK42<>\"\",IF(E42<>\"\",ABS(24*60*(E42-AK42)),ABS(24*60*(G42-AK42))),0)","v":0},null,{"$f":"IF(AM42<>\"\",IF(H42<>\"\",ABS(24*60*(H42-AM42)),ABS(24*60*(F42-AM42))),0)","v":0},null,null,{"$f":"AQ41+R42-S42","v":0}]
[null,null,{"$f":"IF(MONTH(C14)<>2,IF(MONTH(C42+1)>MONTH(C42),\"\",C42+1),\"\")","v":"2020-07-30"},"2020-07-30",null,null,null,null,{"$f":"IF(LEN(F43)+LEN(H43)>0,IF(LEN(H43)>0,(HOUR(F43-E43)+MINUTE(F43-E43)/60)+(HOUR(H43-G43)+MINUTE(H43-G43)/60),(HOUR(F43-E43)+MINUTE(F43-E43)/60)),IF(Parameter!$F$29=1,J43,IF(T43=\"\",0,J43)))","v":0},null,null,null,null,null,null,null,null,{"$f":"IF(I43>J43,I43-J43,0)","v":0},{"$f":"IF(C43<=TODAY(),IF(I43<J43,J43-I43,0),0)","v":0},null,null,null,null,null,null,null,null,null,null,null,null,null,{"$f":"IF(AF43<>\"\",IF(E43<>\"\",ABS(24*60*(E43-AF43)),ABS(24*60*(G43-AF43))),0)","v":0},{"$f":"COUNTA(AF43,AI43,AK43,AM43)","v":0},null,{"$f":"IF(AI43<>\"\",IF(H43<>\"\",ABS(24*60*(H43-AI43)),ABS(24*60*(F43-AI43))),0)","v":0},null,{"$f":"IF(AK43<>\"\",IF(E43<>\"\",ABS(24*60*(E43-AK43)),ABS(24*60*(G43-AK43))),0)","v":0},null,{"$f":"IF(AM43<>\"\",IF(H43<>\"\",ABS(24*60*(H43-AM43)),ABS(24*60*(F43-AM43))),0)","v":0},null,null,{"$f":"AQ42+R43-S43","v":0}]
[null,null,{"$f":"IF(MONTH(C14)<>2,IF(MONTH(C43+1)>MONTH(C43),\"\",C43+1),\"\")","v":"2020-07-31"},"2020-07-31",null,null,null,null,{"$f":"IF(LEN(F44)+LEN(H44)>0,IF(LEN(H44)>0,(HOUR(F44-E44)+MINUTE(F44-E44)/60)+(HOUR(H44-G44)+MINUTE(H44-G44)/60),(HOUR(F44-E44)+MINUTE(F44-E44)/60)),IF(Parameter!$F$29=1,J44,IF(T44=\"\",0,J44)))","v":0},null,null,null,null,null,null,null,null,{"$f":"IF(I44>J44,I44-J44,0)","v":0},{"$f":"IF(C44<=TODAY(),IF(I44<J44,J44-I44,0),0)","v":0},null,null,null,null,null,null,null,null,null,null,null,null,null,{"$f":"IF(AF44<>\"\",IF(E44<>\"\",ABS(24*60*(E44-AF44)),ABS(24*60*(G44-AF44))),0)","v":0},{"$f":"COUNTA(AF44,AI44,AK44,AM44)","v":0},null,{"$f":"IF(AI44<>\"\",IF(H44<>\"\",ABS(24*60*(H44-AI44)),ABS(24*60*(F44-AI44))),0)","v":0},null,{"$f":"IF(AK44<>\"\",IF(E44<>\"\",ABS(24*60*(E44-AK44)),ABS(24*60*(G44-AK44))),0)","v":0},null,{"$f":"IF(AM44<>\"\",IF(H44<>\"\",ABS(24*60*(H44-AM44)),ABS(24*60*(F44-AM44))),0)","v":0},null,null,{"$f":"AQ43+R44-S44","v":0}]
[null,null,null,null,null,null,null,"Summe:",{"$f":"ROUND(SUM(I14:I44),2)","v":0},{"$f":"ROUND(SUM(J13:J44),2)","v":0},{"$f":"SUM(K14:K44)","v":0},0,0,0,0,0,0,{"$f":"ROUND(SUM(R14:R44),2)","v":0},{"$f":"ROUND(SUM(S14:S44),2)","v":0},{"$f":"IF(COUNTA(T14:T44)=0,\"\",\"/U:\" & COUNTIF(T14:T44,\"u\")&\"/K:\" & COUNTIF(T14:T44,\"k\")&\"/Rest:\" & COUNTA(T14:T44)-COUNTIF(T14:T44,\"u\")-COUNTIF(T14:T44,\"k\"))","v":""},null,null,"Kontrollsummen:",null,null,null,null,null,null,null,null,null,null,null,null,null,null,null,null,null,null,null,null,{"$f":"SUM(AR14:AR44)","v":0},0,0,0,null,0,0,null,"Durchschnitt"]
[null,null,null,null,null,null,null,null,null,null,null,null,null,null,null,null,null,{"$f":"ROUND(R45-S45,2)","v":0},null,"Monatssaldo",null,null,{"$f":"\"IST-Stunden \"&ISTsumme&\" - SOLL-Stunden \"&SOLLsumme&\" =\"","v":"IST-Stunden 0 - SOLL-Stunden 0 ="},null,null,{"$f":"ISTsumme-SOLLsumme","v":0},null,null,null,null,null,null,null,null,null,null,null,null,null,null,null,null,null,null,null,null,null,null,null,null,null,{"$f":"IFERROR(SUM(AZ14:AZ44)/COUNTA(AZ14:AZ44),\"\")","v":""}]
[null,null,"Über-/Mehrstunden",null,null,{"$f":"ROUND(AT45+AU45,2)","v":0},"korr.Endsaldo inkl.Vorperiode:",null,null,null,null,null,null,null,null,null,null,{"$f":"ROUND(R9+R46,2)+F48","v":0},null,"Endsaldo inkl.Vorperiode",null,null,{"$f":"IF(M45<>0,\"minus automatische Überstunden:\",\"Monatssaldo (Zelle R46):\")","v":"Monatssaldo (Zelle R46):"},null,null,{"$f":"IF(M45<>0,-M45,R46)","v":0}]
[null,null,"Zeitsaldo Korrektur",null,null,{"$f":"ROUND((AS45-AT45),2)","v":0},null,null,null,null,null,null,null,null,null,null,null,null,null,"Auszahlung Gutstunden",null,null,{"$f":"IF(M45<>0,\"=Monatssaldo (Zelle R46):\",\"Differenz =\")","v":"Differenz ="},null,null,{"$f":"IF(M45<>0,(Z46+Z47),ROUND(Z46-Z47,1))","v":0}]
[null,null,"Info Lohn: ",null,null,null,null,null,null,null,null,null,null,null,null,null,null,{"$f":"R47-R48","v":0},null,"Vortrag abzgl.Auszahlg.",null,null,{"$f":"IF(M45<>0,\"Differenz =\",\"\")","v":""},null,null,{"$f":"IF(M45<>0,ROUND(Z48-R46,1),\"\")","v":""}]

{"sheet":"8 AUG","index":10,"n_rows":49,"n_cols":75,"rows_kept":49,"cut":false,"hidden":false,"merged":[[2,30,2,32],[2,34,2,35],[2,37,2,38],[11,34,11,35],[11,37,11,38],[10,51,12,51],[46,2,46,4],[47,2,47,4],[47,6,47,9],[10,49,12,49],[47,14,47,16],[47,17,47,18],[46,17,46,18],[45,17,45,18],[10,14,12,14],[10,11,12,11],[10,43,12,43],[44,19,44,20],[10,42,12,42],[46,6,46,16],[47,10,47,13],[10,2,11,2],[11,4,11,5],[7,16,8,16],[10,10,12,10],[7,12,8,12],[7,14,8,14],[7,15,8,15],[10,50,12,50],[10,44,12,44],[10,45,12,45],[10,46,12,46],[10,47,12,47],[10,48,12,48],[0,22,0,26],[2,2,2,18],[45,8,45,9],[10,19,12,19],[10,3,11,3],[8,17,8,18],[10,20,12,20],[5,5,5,8],[6,26,7,26],[8,2,8,3],[8,4,8,8],[11,6,11,7],[45,22,45,24],[5,10,5,13],[7,10,8,10],[7,13,8,13],[5,27,6,27],[8,26,9,26],[10,22,10,26],[11,23,11,24],[11,25,11,26],[5,22,5,24],[11,22,12,22],[48,22,48,24],[46,22,46,24],[45,19,45,21],[46,19,46,21],[47,19,47,21],[48,19,48,21],[47,22,47,24],[5,16,6,16],[48,2,48,3],[48,4,48,9],[5,17,7,18],[10,12,12,12],[10,13,12,13],[10,15,12,15],[10,16,12,16],[48,17,48,18],[7,4,7,8],[5,2,5,4],[7,2,7,3],[11,17,11,18],[10,8,11,9],[10,4,10,7],[7,11,8,11],[2,74,11,74],[2,69,11,69],[2,70,11,70],[2,71,11,71],[2,72,11,72],[2,73,11,73]]}
[]
[]
[null,null,null,null,null,null,null,null,null,null,null,null,null,null,null,null,null,null,null,null,null,null,null,null,null,null,null,null,null,null,null,null,null,null,null,null,null,null,null,null,null,null,null,null,null,null,null,null,null,null,null,null,null,null,null,null,null,null,null,null,null,null,null,null,null,null,null,null,null,{"$f":"IF(AND(Parameter!B69<>\"\"),Parameter!B69&\" \"&Parameter!E69&\"%\",\"\")","v":"Zuschlag vor DP-Beginn 25%"},{"$f":"IF(AND(Parameter!E70<>\"\",Parameter!F70<>\"\"),Parameter!B70&\" \"&TEXT(Parameter!F70,\"hh:mm\")&\" \"&Parameter!E70&\"%\",\"\")","v":"Zuschlag innerhalb DP \nnach 1.Uhrzeit 19:30 50%"},{"$f":"Parameter!B71&\" \"&TEXT(Parameter!F71,\"hh:mm\")&\" \"&Parameter!E71&\"%\"","v":"Zuschlag innerhalb DP \nnach 2.Uhrzeit 21:00 75%"},{"$f":"Parameter!B72&\" \"&TEXT(Parameter!F72,\"hh:mm\")&\" \"&Parameter!E72&\"%\"","v":"Zuschlag außerhalb DP \nnach 1.Uhrzeit 19:30 100%"},{"$f":"Parameter!B73&\" \"&TEXT(Parameter!F73,\"hh:mm\")&\" \"&Parameter!E73&\"%\"","v":"Zuschlag außerhalb DP \nnach 2.Uhrzeit 21:00 125%"},{"$f":"IF(AND(Parameter!B74<>\"\"),Parameter!B74&\" \"&Parameter!E74&\"%\",\"\")","v":"Zuschlag nach DP-Ende 150%"}]
[]
[]
[null,null,"Monat",null,null,{"$f":"MonatsErster+213","v":"2020-08-01"},null,null,null,null,"täglich",null,null,null,"So/Feier","Woche",{"$f":"IF(LEFT(Parameter!J62,1)=\"1\",\"Manuell\",\"Morgen Zeit\")","v":"Manuell"},"Vortrag\nVormonat"]
[]
[null,null,"MitarbeitNr.",null,{"$f":"IF('1 JAN'!E8<>\"\",'1 JAN'!E8,\"\")","v":""},null,null,null,null,null,{"$f":"Parameter!Q50","v":">21:00   100% Üh   "},{"$f":"Parameter!Q52","v":">19:30   50% Üh   "},{"$f":"Parameter!Q54","v":">9h                 50% Üh   "},{"$f":"Parameter!Q56","v":"> Soll-h bis 9 Std.                    50% Üh   "},{"$f":"Parameter!Q58","v":"So/Feiert 100% Üh   "},{"$f":"Parameter!Q60","v":">39h      100% Üh   "},{"$f":"Parameter!Q62","v":"manuell    50% Mh   "}]
[null,null,"Name:",null,{"$f":"IF('1 JAN'!E9<>\"\",'1 JAN'!E9,\"\")","v":""},null,null,null,null,null,null,null,null,null,null,null,null,{"$f":"IF(Parameter!F34=TRUE,'7 JUL'!R49:S49,0)","v":0}]
[null,null,null,{"$f":"IF(D16=\"Fr\",\"JA\",\"\")","v":""}]
[null,null,"Datum","Tag","tatsächliche Arbeitszeit",null,null,null," Gesamt\nStunden",null,{"$f":"MID(Parameter!F50,3,99)","v":"Grund-Stunde ZA - Zuschlag auszahlen"},{"$f":"MID(Parameter!F52,3,99)","v":"Grund-Stunde ZA - Zuschlag auszahlen"},{"$f":"MID(Parameter!F54,3,99)","v":"Grund-Stunde ZA - Zuschlag auszahlen"},{"$f":"MID(Parameter!F56,3,99)","v":"Grund-Stunde ZA - Zuschlag auszahlen"},{"$f":"MID(Parameter!F58,3,99)","v":"Grund-Stunde ZA - Zuschlag auszahlen"},{"$f":"MID(Parameter!F60,3,99)","v":"Grund-Stunde ZA - Zuschlag auszahlen"},{"$f":"MID(Parameter!F62,3,99)","v":"Grund-Stunde ZA - Zuschlag auszahlen"},"Gut-","Minus-"," Urlaub\nKrank\n\nU oder K \nmachen","Feiertag\n\nF-ix\nB-ewegl.",null,{"$f":"IF(AND(UPPER(Parameter!G68=\"AKTIV\"),UPPER(Parameter!R69=\"AKTIV\")),\"Dienstplan-Vorschlag übernehmen\",IF(UPPER(Parameter!G68=\"AKTIV\"),\"Dienstplan\",\"Manuelle Zeiterfassung\"))","v":"Manuelle Zeiterfassung"},null,null,null,null,null,null,null,null,null,null,null,null,null,null,null,null,null,null,null,"Aktueller\nTages\nSaldo","Summe Grundstunden\nim Zeitsaldo","Summe \nZuschlag \nZeitsaldo \nerhöhend","Summe Grundstunden\nzur Auszahlung","Summe \nZuschlag\nzur Auszahlung","Korrigierter Tagessaldo","Korrigierte \nTages IST-Std","Differenz SOLL-Std zu IST-Std inkl. Zeitsaldo Korrekturen","Tagesstunden + sonntags Summe Wochen-\nStunden","Wochen\nsumme \n(korrigiert)"]
[null,null,null,null,"Vormittag",null,"Nachmittag",null,null,null,null,null,null,null,null,null,null,"Stunden",null,null,null,null,{"$f":"IF(UPPER(Parameter!G68)=\"AKTIV\",\"Manuelle Zeiten in Spalte W sind monatlich manuell in die Spalten E-H zu übernehmen\",\"Begründung manuelle Zeiterfassung\")","v":"Begründung manuelle Zeiterfassung"},"Vormittag",null,"Nachmittag"]
[null,"OK",null,null,"von","bis","von","bis","Ist","Soll",null,null,null,null,null,null,null,"+","-",null,null,null,null,"von","bis","von","bis",null,null,null,"Anmerkung","Internet AN Vorm.","Differenz","Anzahl Internetzeiten","Internet AB Vorm","Differenz","Internet AN Nachm.","Differenz","Internet AB Nachm.","Differenz",null,null,null,null,null,null,null,null,null,null,null,null,null,null,null,null,null,null,null,null,null,null,null,null,null,null,null,null,null,{"$f":"SUM(BR14:BR44)","v":0},0,0,0,0,0]
[null,null,{"$f":"DATE('1 JAN'!G2,8,1)","v":"2020-08-01"},{"$f":"C14","v":"2020-08-01"},null,null,null,null,{"$f":"IF(LEN(F14)+LEN(H14)>0,IF(LEN(H14)>0,(HOUR(F14-E14)+MINUTE(F14-E14)/60)+(HOUR(H14-G14)+MINUTE(H14-G14)/60),(HOUR(F14-E14)+MINUTE(F14-E14)/60)),IF(Parameter!$F$29=1,J14,IF(T14=\"\",0,J14)))","v":0},null,null,null,null,null,null,null,null,{"$f":"IF(I14>J14,I14-J14,0)","v":0},{"$f":"IF(C14<=TODAY(),IF(I14<J14,J14-I14,0),0)","v":0},null,null,null,null,null,null,null,null,null,null,null,null,null,{"$f":"IF(AF14<>\"\",IF(E14<>\"\",ABS(24*60*(E14-AF14)),ABS(24*60*(G14-AF14))),0)","v":0},{"$f":"COUNTA(AF14,AI14,AK14,AM14)","v":0},null,{"$f":"IF(AI14<>\"\",IF(H14<>\"\",ABS(24*60*(H14-AI14)),ABS(24*60*(F14-AI14))),0)","v":0},null,{"$f":"IF(AK14<>\"\",IF(E14<>\"\",ABS(24*60*(E14-AK14)),ABS(24*60*(G14-AK14))),0)","v":0},null,{"$f":"IF(AM14<>\"\",IF(H14<>\"\",ABS(24*60*(H14-AM14)),ABS(24*60*(F14-AM14))),0)","v":0},null,null,{"$f":"R9+R14-S14","v":0}]
[null,null,{"$f":"IF(MONTH(C14+1)>MONTH(C14),\"\",C14+1)","v":"2020-08-02"},"2020-08-02",null,null,null,null,{"$f":"IF(LEN(F15)+LEN(H15)>0,IF(LEN(H15)>0,(HOUR(F15-E15)+MINUTE(F15-E15)/60)+(HOUR(H15-G15)+MINUTE(H15-G15)/60),(HOUR(F15-E15)+MINUTE(F15-E15)/60)),IF(Parameter!$F$29=1,J15,IF(T15=\"\",0,J15)))","v":0},null,null,null,null,null,null,null,null,{"$f":"IF(I15>J15,I15-J15,0)","v":0},{"$f":"IF(C15<=TODAY(),IF(I15<J15,J15-I15,0),0)","v":0},null,null,null,null,null,null,null,null,null,null,null,null,null,{"$f":"IF(AF15<>\"\",IF(E15<>\"\",ABS(24*60*(E15-AF15)),ABS(24*60*(G15-AF15))),0)","v":0},{"$f":"COUNTA(AF15,AI15,AK15,AM15)","v":0},null,{"$f":"IF(AI15<>\"\",IF(H15<>\"\",ABS(24*60*(H15-AI15)),ABS(24*60*(F15-AI15))),0)","v":0},null,{"$f":"IF(AK15<>\"\",IF(E15<>\"\",ABS(24*60*(E15-AK15)),ABS(24*60*(G15-AK15))),0)","v":0},null,{"$f":"IF(AM15<>\"\",IF(H15<>\"\",ABS(24*60*(H15-AM15)),ABS(24*60*(F15-AM15))),0)","v":0},null,null,{"$f":"AQ14+R15-S15","v":0}]
[null,null,"2020-08-03","2020-08-03",null,null,null,null,{"$f":"IF(LEN(F16)+LEN(H16)>0,IF(LEN(H16)>0,(HOUR(F16-E16)+MINUTE(F16-E16)/60)+(HOUR(H16-G16)+MINUTE(H16-G16)/60),(HOUR(F16-E16)+MINUTE(F16-E16)/60)),IF(Parameter!$F$29=1,J16,IF(T16=\"\",0,J16)))","v":0},null,null,null,null,null,null,null,null,{"$f":"IF(I16>J16,I16-J16,0)","v":0},{"$f":"IF(C16<=TODAY(),IF(I16<J16,J16-I16,0),0)","v":0},null,null,null,null,null,null,null,null,null,null,null,null,null,{"$f":"IF(AF16<>\"\",IF(E16<>\"\",ABS(24*60*(E16-AF16)),ABS(24*60*(G16-AF16))),0)","v":0},{"$f":"COUNTA(AF16,AI16,AK16,AM16)","v":0},null,{"$f":"IF(AI16<>\"\",IF(H16<>\"\",ABS(24*60*(H16-AI16)),ABS(24*60*(F16-AI16))),0)","v":0},null,{"$f":"IF(AK16<>\"\",IF(E16<>\"\",ABS(24*60*(E16-AK16)),ABS(24*60*(G16-AK16))),0)","v":0},null,{"$f":"IF(AM16<>\"\",IF(H16<>\"\",ABS(24*60*(H16-AM16)),ABS(24*60*(F16-AM16))),0)","v":0},null,null,{"$f":"AQ15+R16-S16","v":0}]
[null,null,"2020-08-04","2020-08-04",null,null,null,null,{"$f":"IF(LEN(F17)+LEN(H17)>0,IF(LEN(H17)>0,(HOUR(F17-E17)+MINUTE(F17-E17)/60)+(HOUR(H17-G17)+MINUTE(H17-G17)/60),(HOUR(F17-E17)+MINUTE(F17-E17)/60)),IF(Parameter!$F$29=1,J17,IF(T17=\"\",0,J17)))","v":0},null,null,null,null,null,null,null,null,{"$f":"IF(I17>J17,I17-J17,0)","v":0},{"$f":"IF(C17<=TODAY(),IF(I17<J17,J17-I17,0),0)","v":0},null,null,null,null,null,null,null,null,null,null,null,null,null,{"$f":"IF(AF17<>\"\",IF(E17<>\"\",ABS(24*60*(E17-AF17)),ABS(24*60*(G17-AF17))),0)","v":0},{"$f":"COUNTA(AF17,AI17,AK17,AM17)","v":0},null,{"$f":"IF(AI17<>\"\",IF(H17<>\"\",ABS(24*60*(H17-AI17)),ABS(24*60*(F17-AI17))),0)","v":0},null,{"$f":"IF(AK17<>\"\",IF(E17<>\"\",ABS(24*60*(E17-AK17)),ABS(24*60*(G17-AK17))),0)","v":0},null,{"$f":"IF(AM17<>\"\",IF(H17<>\"\",ABS(24*60*(H17-AM17)),ABS(24*60*(F17-AM17))),0)","v":0},null,null,{"$f":"AQ16+R17-S17","v":0}]
[null,null,"2020-08-05","2020-08-05",null,null,null,null,{"$f":"IF(LEN(F18)+LEN(H18)>0,IF(LEN(H18)>0,(HOUR(F18-E18)+MINUTE(F18-E18)/60)+(HOUR(H18-G18)+MINUTE(H18-G18)/60),(HOUR(F18-E18)+MINUTE(F18-E18)/60)),IF(Parameter!$F$29=1,J18,IF(T18=\"\",0,J18)))","v":0},null,null,null,null,null,null,null,null,{"$f":"IF(I18>J18,I18-J18,0)","v":0},{"$f":"IF(C18<=TODAY(),IF(I18<J18,J18-I18,0),0)","v":0},null,null,null,null,null,null,null,null,null,null,null,null,null,{"$f":"IF(AF18<>\"\",IF(E18<>\"\",ABS(24*60*(E18-AF18)),ABS(24*60*(G18-AF18))),0)","v":0},{"$f":"COUNTA(AF18,AI18,AK18,AM18)","v":0},null,{"$f":"IF(AI18<>\"\",IF(H18<>\"\",ABS(24*60*(H18-AI18)),ABS(24*60*(F18-AI18))),0)","v":0},null,{"$f":"IF(AK18<>\"\",IF(E18<>\"\",ABS(24*60*(E18-AK18)),ABS(24*60*(G18-AK18))),0)","v":0},null,{"$f":"IF(AM18<>\"\",IF(H18<>\"\",ABS(24*60*(H18-AM18)),ABS(24*60*(F18-AM18))),0)","v":0},null,null,{"$f":"AQ17+R18-S18","v":0}]
[null,null,"2020-08-06","2020-08-06",null,null,null,null,{"$f":"IF(LEN(F19)+LEN(H19)>0,IF(LEN(H19)>0,(HOUR(F19-E19)+MINUTE(F19-E19)/60)+(HOUR(H19-G19)+MINUTE(H19-G19)/60),(HOUR(F19-E19)+MINUTE(F19-E19)/60)),IF(Parameter!$F$29=1,J19,IF(T19=\"\",0,J19)))","v":0},null,null,null,null,null,null,null,null,{"$f":"IF(I19>J19,I19-J19,0)","v":0},{"$f":"IF(C19<=TODAY(),IF(I19<J19,J19-I19,0),0)","v":0},null,null,null,null,null,null,null,null,null,null,null,null,null,{"$f":"IF(AF19<>\"\",IF(E19<>\"\",ABS(24*60*(E19-AF19)),ABS(24*60*(G19-AF19))),0)","v":0},{"$f":"COUNTA(AF19,AI19,AK19,AM19)","v":0},null,{"$f":"IF(AI19<>\"\",IF(H19<>\"\",ABS(24*60*(H19-AI19)),ABS(24*60*(F19-AI19))),0)","v":0},null,{"$f":"IF(AK19<>\"\",IF(E19<>\"\",ABS(24*60*(E19-AK19)),ABS(24*60*(G19-AK19))),0)","v":0},null,{"$f":"IF(AM19<>\"\",IF(H19<>\"\",ABS(24*60*(H19-AM19)),ABS(24*60*(F19-AM19))),0)","v":0},null,null,{"$f":"AQ18+R19-S19","v":0}]
[null,null,"2020-08-07","2020-08-07",null,null,null,null,{"$f":"IF(LEN(F20)+LEN(H20)>0,IF(LEN(H20)>0,(HOUR(F20-E20)+MINUTE(F20-E20)/60)+(HOUR(H20-G20)+MINUTE(H20-G20)/60),(HOUR(F20-E20)+MINUTE(F20-E20)/60)),IF(Parameter!$F$29=1,J20,IF(T20=\"\",0,J20)))","v":0},null,null,null,null,null,null,null,null,{"$f":"IF(I20>J20,I20-J20,0)","v":0},{"$f":"IF(C20<=TODAY(),IF(I20<J20,J20-I20,0),0)","v":0},null,null,null,null,null,null,null,null,null,null,null,null,null,{"$f":"IF(AF20<>\"\",IF(E20<>\"\",ABS(24*60*(E20-AF20)),ABS(24*60*(G20-AF20))),0)","v":0},{"$f":"COUNTA(AF20,AI20,AK20,AM20)","v":0},null,{"$f":"IF(AI20<>\"\",IF(H20<>\"\",ABS(24*60*(H20-AI20)),ABS(24*60*(F20-AI20))),0)","v":0},null,{"$f":"IF(AK20<>\"\",IF(E20<>\"\",ABS(24*60*(E20-AK20)),ABS(24*60*(G20-AK20))),0)","v":0},null,{"$f":"IF(AM20<>\"\",IF(H20<>\"\",ABS(24*60*(H20-AM20)),ABS(24*60*(F20-AM20))),0)","v":0},null,null,{"$f":"AQ19+R20-S20","v":0}]
[null,null,"2020-08-08","2020-08-08",null,null,null,null,{"$f":"IF(LEN(F21)+LEN(H21)>0,IF(LEN(H21)>0,(HOUR(F21-E21)+MINUTE(F21-E21)/60)+(HOUR(H21-G21)+MINUTE(H21-G21)/60),(HOUR(F21-E21)+MINUTE(F21-E21)/60)),IF(Parameter!$F$29=1,J21,IF(T21=\"\",0,J21)))","v":0},null,null,null,null,null,null,null,null,{"$f":"IF(I21>J21,I21-J21,0)","v":0},{"$f":"IF(C21<=TODAY(),IF(I21<J21,J21-I21,0),0)","v":0},null,null,null,null,null,null,null,null,null,null,null,null,null,{"$f":"IF(AF21<>\"\",IF(E21<>\"\",ABS(24*60*(E21-AF21)),ABS(24*60*(G21-AF21))),0)","v":0},{"$f":"COUNTA(AF21,AI21,AK21,AM21)","v":0},null,{"$f":"IF(AI21<>\"\",IF(H21<>\"\",ABS(24*60*(H21-AI21)),ABS(24*60*(F21-AI21))),0)","v":0},null,{"$f":"IF(AK21<>\"\",IF(E21<>\"\",ABS(24*60*(E21-AK21)),ABS(24*60*(G21-AK21))),0)","v":0},null,{"$f":"IF(AM21<>\"\",IF(H21<>\"\",ABS(24*60*(H21-AM21)),ABS(24*60*(F21-AM21))),0)","v":0},null,null,{"$f":"AQ20+R21-S21","v":0}]
[null,null,"2020-08-09","2020-08-09",null,null,null,null,{"$f":"IF(LEN(F22)+LEN(H22)>0,IF(LEN(H22)>0,(HOUR(F22-E22)+MINUTE(F22-E22)/60)+(HOUR(H22-G22)+MINUTE(H22-G22)/60),(HOUR(F22-E22)+MINUTE(F22-E22)/60)),IF(Parameter!$F$29=1,J22,IF(T22=\"\",0,J22)))","v":0},null,null,null,null,null,null,null,null,{"$f":"IF(I22>J22,I22-J22,0)","v":0},{"$f":"IF(C22<=TODAY(),IF(I22<J22,J22-I22,0),0)","v":0},null,null,null,null,null,null,null,null,null,null,null,null,null,{"$f":"IF(AF22<>\"\",IF(E22<>\"\",ABS(24*60*(E22-AF22)),ABS(24*60*(G22-AF22))),0)","v":0},{"$f":"COUNTA(AF22,AI22,AK22,AM22)","v":0},null,{"$f":"IF(AI22<>\"\",IF(H22<>\"\",ABS(24*60*(H22-AI22)),ABS(24*60*(F22-AI22))),0)","v":0},null,{"$f":"IF(AK22<>\"\",IF(E22<>\"\",ABS(24*60*(E22-AK22)),ABS(24*60*(G22-AK22))),0)","v":0},null,{"$f":"IF(AM22<>\"\",IF(H22<>\"\",ABS(24*60*(H22-AM22)),ABS(24*60*(F22-AM22))),0)","v":0},null,null,{"$f":"AQ21+R22-S22","v":0}]
[null,null,"2020-08-10","2020-08-10",null,null,null,null,{"$f":"IF(LEN(F23)+LEN(H23)>0,IF(LEN(H23)>0,(HOUR(F23-E23)+MINUTE(F23-E23)/60)+(HOUR(H23-G23)+MINUTE(H23-G23)/60),(HOUR(F23-E23)+MINUTE(F23-E23)/60)),IF(Parameter!$F$29=1,J23,IF(T23=\"\",0,J23)))","v":0},null,null,null,null,null,null,null,null,{"$f":"IF(I23>J23,I23-J23,0)","v":0},{"$f":"IF(C23<=TODAY(),IF(I23<J23,J23-I23,0),0)","v":0},null,null,null,null,null,null,null,null,null,null,null,null,null,{"$f":"IF(AF23<>\"\",IF(E23<>\"\",ABS(24*60*(E23-AF23)),ABS(24*60*(G23-AF23))),0)","v":0},{"$f":"COUNTA(AF23,AI23,AK23,AM23)","v":0},null,{"$f":"IF(AI23<>\"\",IF(H23<>\"\",ABS(24*60*(H23-AI23)),ABS(24*60*(F23-AI23))),0)","v":0},null,{"$f":"IF(AK23<>\"\",IF(E23<>\"\",ABS(24*60*(E23-AK23)),ABS(24*60*(G23-AK23))),0)","v":0},null,{"$f":"IF(AM23<>\"\",IF(H23<>\"\",ABS(24*60*(H23-AM23)),ABS(24*60*(F23-AM23))),0)","v":0},null,null,{"$f":"AQ22+R23-S23","v":0}]
[null,null,"2020-08-11","2020-08-11",null,null,null,null,{"$f":"IF(LEN(F24)+LEN(H24)>0,IF(LEN(H24)>0,(HOUR(F24-E24)+MINUTE(F24-E24)/60)+(HOUR(H24-G24)+MINUTE(H24-G24)/60),(HOUR(F24-E24)+MINUTE(F24-E24)/60)),IF(Parameter!$F$29=1,J24,IF(T24=\"\",0,J24)))","v":0},null,null,null,null,null,null,null,null,{"$f":"IF(I24>J24,I24-J24,0)","v":0},{"$f":"IF(C24<=TODAY(),IF(I24<J24,J24-I24,0),0)","v":0},null,null,null,null,null,null,null,null,null,null,null,null,null,{"$f":"IF(AF24<>\"\",IF(E24<>\"\",ABS(24*60*(E24-AF24)),ABS(24*60*(G24-AF24))),0)","v":0},{"$f":"COUNTA(AF24,AI24,AK24,AM24)","v":0},null,{"$f":"IF(AI24<>\"\",IF(H24<>\"\",ABS(24*60*(H24-AI24)),ABS(24*60*(F24-AI24))),0)","v":0},null,{"$f":"IF(AK24<>\"\",IF(E24<>\"\",ABS(24*60*(E24-AK24)),ABS(24*60*(G24-AK24))),0)","v":0},null,{"$f":"IF(AM24<>\"\",IF(H24<>\"\",ABS(24*60*(H24-AM24)),ABS(24*60*(F24-AM24))),0)","v":0},null,null,{"$f":"AQ23+R24-S24","v":0}]
[null,null,"2020-08-12","2020-08-12",null,null,null,null,{"$f":"IF(LEN(F25)+LEN(H25)>0,IF(LEN(H25)>0,(HOUR(F25-E25)+MINUTE(F25-E25)/60)+(HOUR(H25-G25)+MINUTE(H25-G25)/60),(HOUR(F25-E25)+MINUTE(F25-E25)/60)),IF(Parameter!$F$29=1,J25,IF(T25=\"\",0,J25)))","v":0},null,null,null,null,null,null,null,null,{"$f":"IF(I25>J25,I25-J25,0)","v":0},{"$f":"IF(C25<=TODAY(),IF(I25<J25,J25-I25,0),0)","v":0},null,null,null,null,null,null,null,null,null,null,null,null,null,{"$f":"IF(AF25<>\"\",IF(E25<>\"\",ABS(24*60*(E25-AF25)),ABS(24*60*(G25-AF25))),0)","v":0},{"$f":"COUNTA(AF25,AI25,AK25,AM25)","v":0},null,{"$f":"IF(AI25<>\"\",IF(H25<>\"\",ABS(24*60*(H25-AI25)),ABS(24*60*(F25-AI25))),0)","v":0},null,{"$f":"IF(AK25<>\"\",IF(E25<>\"\",ABS(24*60*(E25-AK25)),ABS(24*60*(G25-AK25))),0)","v":0},null,{"$f":"IF(AM25<>\"\",IF(H25<>\"\",ABS(24*60*(H25-AM25)),ABS(24*60*(F25-AM25))),0)","v":0},null,null,{"$f":"AQ24+R25-S25","v":0}]
[null,null,"2020-08-13","2020-08-13",null,null,null,null,{"$f":"IF(LEN(F26)+LEN(H26)>0,IF(LEN(H26)>0,(HOUR(F26-E26)+MINUTE(F26-E26)/60)+(HOUR(H26-G26)+MINUTE(H26-G26)/60),(HOUR(F26-E26)+MINUTE(F26-E26)/60)),IF(Parameter!$F$29=1,J26,IF(T26=\"\",0,J26)))","v":0},null,null,null,null,null,null,null,null,{"$f":"IF(I26>J26,I26-J26,0)","v":0},{"$f":"IF(C26<=TODAY(),IF(I26<J26,J26-I26,0),0)","v":0},null,null,null,null,null,null,null,null,null,null,null,null,null,{"$f":"IF(AF26<>\"\",IF(E26<>\"\",ABS(24*60*(E26-AF26)),ABS(24*60*(G26-AF26))),0)","v":0},{"$f":"COUNTA(AF26,AI26,AK26,AM26)","v":0},null,{"$f":"IF(AI26<>\"\",IF(H26<>\"\",ABS(24*60*(H26-AI26)),ABS(24*60*(F26-AI26))),0)","v":0},null,{"$f":"IF(AK26<>\"\",IF(E26<>\"\",ABS(24*60*(E26-AK26)),ABS(24*60*(G26-AK26))),0)","v":0},null,{"$f":"IF(AM26<>\"\",IF(H26<>\"\",ABS(24*60*(H26-AM26)),ABS(24*60*(F26-AM26))),0)","v":0},null,null,{"$f":"AQ25+R26-S26","v":0}]
[null,null,"2020-08-14","2020-08-14",null,null,null,null,{"$f":"IF(LEN(F27)+LEN(H27)>0,IF(LEN(H27)>0,(HOUR(F27-E27)+MINUTE(F27-E27)/60)+(HOUR(H27-G27)+MINUTE(H27-G27)/60),(HOUR(F27-E27)+MINUTE(F27-E27)/60)),IF(Parameter!$F$29=1,J27,IF(T27=\"\",0,J27)))","v":0},null,null,null,null,null,null,null,null,{"$f":"IF(I27>J27,I27-J27,0)","v":0},{"$f":"IF(C27<=TODAY(),IF(I27<J27,J27-I27,0),0)","v":0},null,null,null,null,null,null,null,null,null,null,null,null,null,{"$f":"IF(AF27<>\"\",IF(E27<>\"\",ABS(24*60*(E27-AF27)),ABS(24*60*(G27-AF27))),0)","v":0},{"$f":"COUNTA(AF27,AI27,AK27,AM27)","v":0},null,{"$f":"IF(AI27<>\"\",IF(H27<>\"\",ABS(24*60*(H27-AI27)),ABS(24*60*(F27-AI27))),0)","v":0},null,{"$f":"IF(AK27<>\"\",IF(E27<>\"\",ABS(24*60*(E27-AK27)),ABS(24*60*(G27-AK27))),0)","v":0},null,{"$f":"IF(AM27<>\"\",IF(H27<>\"\",ABS(24*60*(H27-AM27)),ABS(24*60*(F27-AM27))),0)","v":0},null,null,{"$f":"AQ26+R27-S27","v":0}]
[null,null,"2020-08-15","2020-08-15",null,null,null,null,{"$f":"IF(LEN(F28)+LEN(H28)>0,IF(LEN(H28)>0,(HOUR(F28-E28)+MINUTE(F28-E28)/60)+(HOUR(H28-G28)+MINUTE(H28-G28)/60),(HOUR(F28-E28)+MINUTE(F28-E28)/60)),IF(Parameter!$F$29=1,J28,IF(T28=\"\",0,J28)))","v":0},null,null,null,null,null,null,null,null,{"$f":"IF(I28>J28,I28-J28,0)","v":0},{"$f":"IF(C28<=TODAY(),IF(I28<J28,J28-I28,0),0)","v":0},null,"F",null,null,null,null,null,null,null,null,null,null,null,{"$f":"IF(AF28<>\"\",IF(E28<>\"\",ABS(24*60*(E28-AF28)),ABS(24*60*(G28-AF28))),0)","v":0},{"$f":"COUNTA(AF28,AI28,AK28,AM28)","v":0},null,{"$f":"IF(AI28<>\"\",IF(H28<>\"\",ABS(24*60*(H28-AI28)),ABS(24*60*(F28-AI28))),0)","v":0},null,{"$f":"IF(AK28<>\"\",IF(E28<>\"\",ABS(24*60*(E28-AK28)),ABS(24*60*(G28-AK28))),0)","v":0},null,{"$f":"IF(AM28<>\"\",IF(H28<>\"\",ABS(24*60*(H28-AM28)),ABS(24*60*(F28-AM28))),0)","v":0},null,null,{"$f":"AQ27+R28-S28","v":0}]
[null,null,"2020-08-16","2020-08-16",null,null,null,null,{"$f":"IF(LEN(F29)+LEN(H29)>0,IF(LEN(H29)>0,(HOUR(F29-E29)+MINUTE(F29-E29)/60)+(HOUR(H29-G29)+MINUTE(H29-G29)/60),(HOUR(F29-E29)+MINUTE(F29-E29)/60)),IF(Parameter!$F$29=1,J29,IF(T29=\"\",0,J29)))","v":0},null,null,null,null,null,null,null,null,{"$f":"IF(I29>J29,I29-J29,0)","v":0},{"$f":"IF(C29<=TODAY(),IF(I29<J29,J29-I29,0),0)","v":0},null,null,null,null,null,null,null,null,null,null,null,null,null,{"$f":"IF(AF29<>\"\",IF(E29<>\"\",ABS(24*60*(E29-AF29)),ABS(24*60*(G29-AF29))),0)","v":0},{"$f":"COUNTA(AF29,AI29,AK29,AM29)","v":0},null,{"$f":"IF(AI29<>\"\",IF(H29<>\"\",ABS(24*60*(H29-AI29)),ABS(24*60*(F29-AI29))),0)","v":0},null,{"$f":"IF(AK29<>\"\",IF(E29<>\"\",ABS(24*60*(E29-AK29)),ABS(24*60*(G29-AK29))),0)","v":0},null,{"$f":"IF(AM29<>\"\",IF(H29<>\"\",ABS(24*60*(H29-AM29)),ABS(24*60*(F29-AM29))),0)","v":0},null,null,{"$f":"AQ28+R29-S29","v":0}]
[null,null,"2020-08-17","2020-08-17",null,null,null,null,{"$f":"IF(LEN(F30)+LEN(H30)>0,IF(LEN(H30)>0,(HOUR(F30-E30)+MINUTE(F30-E30)/60)+(HOUR(H30-G30)+MINUTE(H30-G30)/60),(HOUR(F30-E30)+MINUTE(F30-E30)/60)),IF(Parameter!$F$29=1,J30,IF(T30=\"\",0,J30)))","v":0},null,null,null,null,null,null,null,null,{"$f":"IF(I30>J30,I30-J30,0)","v":0},{"$f":"IF(C30<=TODAY(),IF(I30<J30,J30-I30,0),0)","v":0},null,null,null,null,null,null,null,null,null,null,null,null,null,{"$f":"IF(AF30<>\"\",IF(E30<>\"\",ABS(24*60*(E30-AF30)),ABS(24*60*(G30-AF30))),0)","v":0},{"$f":"COUNTA(AF30,AI30,AK30,AM30)","v":0},null,{"$f":"IF(AI30<>\"\",IF(H30<>\"\",ABS(24*60*(H30-AI30)),ABS(24*60*(F30-AI30))),0)","v":0},null,{"$f":"IF(AK30<>\"\",IF(E30<>\"\",ABS(24*60*(E30-AK30)),ABS(24*60*(G30-AK30))),0)","v":0},null,{"$f":"IF(AM30<>\"\",IF(H30<>\"\",ABS(24*60*(H30-AM30)),ABS(24*60*(F30-AM30))),0)","v":0},null,null,{"$f":"AQ29+R30-S30","v":0}]
[null,null,"2020-08-18","2020-08-18",null,null,null,null,{"$f":"IF(LEN(F31)+LEN(H31)>0,IF(LEN(H31)>0,(HOUR(F31-E31)+MINUTE(F31-E31)/60)+(HOUR(H31-G31)+MINUTE(H31-G31)/60),(HOUR(F31-E31)+MINUTE(F31-E31)/60)),IF(Parameter!$F$29=1,J31,IF(T31=\"\",0,J31)))","v":0},null,null,null,null,null,null,null,null,{"$f":"IF(I31>J31,I31-J31,0)","v":0},{"$f":"IF(C31<=TODAY(),IF(I31<J31,J31-I31,0),0)","v":0},null,null,null,null,null,null,null,null,null,null,null,null,null,{"$f":"IF(AF31<>\"\",IF(E31<>\"\",ABS(24*60*(E31-AF31)),ABS(24*60*(G31-AF31))),0)","v":0},{"$f":"COUNTA(AF31,AI31,AK31,AM31)","v":0},null,{"$f":"IF(AI31<>\"\",IF(H31<>\"\",ABS(24*60*(H31-AI31)),ABS(24*60*(F31-AI31))),0)","v":0},null,{"$f":"IF(AK31<>\"\",IF(E31<>\"\",ABS(24*60*(E31-AK31)),ABS(24*60*(G31-AK31))),0)","v":0},null,{"$f":"IF(AM31<>\"\",IF(H31<>\"\",ABS(24*60*(H31-AM31)),ABS(24*60*(F31-AM31))),0)","v":0},null,null,{"$f":"AQ30+R31-S31","v":0}]
[null,null,"2020-08-19","2020-08-19",null,null,null,null,{"$f":"IF(LEN(F32)+LEN(H32)>0,IF(LEN(H32)>0,(HOUR(F32-E32)+MINUTE(F32-E32)/60)+(HOUR(H32-G32)+MINUTE(H32-G32)/60),(HOUR(F32-E32)+MINUTE(F32-E32)/60)),IF(Parameter!$F$29=1,J32,IF(T32=\"\",0,J32)))","v":0},null,null,null,null,null,null,null,null,{"$f":"IF(I32>J32,I32-J32,0)","v":0},{"$f":"IF(C32<=TODAY(),IF(I32<J32,J32-I32,0),0)","v":0},null,null,null,null,null,null,null,null,null,null,null,null,null,{"$f":"IF(AF32<>\"\",IF(E32<>\"\",ABS(24*60*(E32-AF32)),ABS(24*60*(G32-AF32))),0)","v":0},{"$f":"COUNTA(AF32,AI32,AK32,AM32)","v":0},null,{"$f":"IF(AI32<>\"\",IF(H32<>\"\",ABS(24*60*(H32-AI32)),ABS(24*60*(F32-AI32))),0)","v":0},null,{"$f":"IF(AK32<>\"\",IF(E32<>\"\",ABS(24*60*(E32-AK32)),ABS(24*60*(G32-AK32))),0)","v":0},null,{"$f":"IF(AM32<>\"\",IF(H32<>\"\",ABS(24*60*(H32-AM32)),ABS(24*60*(F32-AM32))),0)","v":0},null,null,{"$f":"AQ31+R32-S32","v":0}]
[null,null,"2020-08-20","2020-08-20",null,null,null,null,{"$f":"IF(LEN(F33)+LEN(H33)>0,IF(LEN(H33)>0,(HOUR(F33-E33)+MINUTE(F33-E33)/60)+(HOUR(H33-G33)+MINUTE(H33-G33)/60),(HOUR(F33-E33)+MINUTE(F33-E33)/60)),IF(Parameter!$F$29=1,J33,IF(T33=\"\",0,J33)))","v":0},null,null,null,null,null,null,null,null,{"$f":"IF(I33>J33,I33-J33,0)","v":0},{"$f":"IF(C33<=TODAY(),IF(I33<J33,J33-I33,0),0)","v":0},null,null,null,null,null,null,null,null,null,null,null,null,null,{"$f":"IF(AF33<>\"\",IF(E33<>\"\",ABS(24*60*(E33-AF33)),ABS(24*60*(G33-AF33))),0)","v":0},{"$f":"COUNTA(AF33,AI33,AK33,AM33)","v":0},null,{"$f":"IF(AI33<>\"\",IF(H33<>\"\",ABS(24*60*(H33-AI33)),ABS(24*60*(F33-AI33))),0)","v":0},null,{"$f":"IF(AK33<>\"\",IF(E33<>\"\",ABS(24*60*(E33-AK33)),ABS(24*60*(G33-AK33))),0)","v":0},null,{"$f":"IF(AM33<>\"\",IF(H33<>\"\",ABS(24*60*(H33-AM33)),ABS(24*60*(F33-AM33))),0)","v":0},null,null,{"$f":"AQ32+R33-S33","v":0}]
[null,null,"2020-08-21","2020-08-21",null,null,null,null,{"$f":"IF(LEN(F34)+LEN(H34)>0,IF(LEN(H34)>0,(HOUR(F34-E34)+MINUTE(F34-E34)/60)+(HOUR(H34-G34)+MINUTE(H34-G34)/60),(HOUR(F34-E34)+MINUTE(F34-E34)/60)),IF(Parameter!$F$29=1,J34,IF(T34=\"\",0,J34)))","v":0},null,null,null,null,null,null,null,null,{"$f":"IF(I34>J34,I34-J34,0)","v":0},{"$f":"IF(C34<=TODAY(),IF(I34<J34,J34-I34,0),0)","v":0},null,null,null,null,null,null,null,null,null,null,null,null,null,{"$f":"IF(AF34<>\"\",IF(E34<>\"\",ABS(24*60*(E34-AF34)),ABS(24*60*(G34-AF34))),0)","v":0},{"$f":"COUNTA(AF34,AI34,AK34,AM34)","v":0},null,{"$f":"IF(AI34<>\"\",IF(H34<>\"\",ABS(24*60*(H34-AI34)),ABS(24*60*(F34-AI34))),0)","v":0},null,{"$f":"IF(AK34<>\"\",IF(E34<>\"\",ABS(24*60*(E34-AK34)),ABS(24*60*(G34-AK34))),0)","v":0},null,{"$f":"IF(AM34<>\"\",IF(H34<>\"\",ABS(24*60*(H34-AM34)),ABS(24*60*(F34-AM34))),0)","v":0},null,null,{"$f":"AQ33+R34-S34","v":0}]
[null,null,"2020-08-22","2020-08-22",null,null,null,null,{"$f":"IF(LEN(F35)+LEN(H35)>0,IF(LEN(H35)>0,(HOUR(F35-E35)+MINUTE(F35-E35)/60)+(HOUR(H35-G35)+MINUTE(H35-G35)/60),(HOUR(F35-E35)+MINUTE(F35-E35)/60)),IF(Parameter!$F$29=1,J35,IF(T35=\"\",0,J35)))","v":0},null,null,null,null,null,null,null,null,{"$f":"IF(I35>J35,I35-J35,0)","v":0},{"$f":"IF(C35<=TODAY(),IF(I35<J35,J35-I35,0),0)","v":0},null,null,null,null,null,null,null,null,null,null,null,null,null,{"$f":"IF(AF35<>\"\",IF(E35<>\"\",ABS(24*60*(E35-AF35)),ABS(24*60*(G35-AF35))),0)","v":0},{"$f":"COUNTA(AF35,AI35,AK35,AM35)","v":0},null,{"$f":"IF(AI35<>\"\",IF(H35<>\"\",ABS(24*60*(H35-AI35)),ABS(24*60*(F35-AI35))),0)","v":0},null,{"$f":"IF(AK35<>\"\",IF(E35<>\"\",ABS(24*60*(E35-AK35)),ABS(24*60*(G35-AK35))),0)","v":0},null,{"$f":"IF(AM35<>\"\",IF(H35<>\"\",ABS(24*60*(H35-AM35)),ABS(24*60*(F35-AM35))),0)","v":0},null,null,{"$f":"AQ34+R35-S35","v":0}]
[null,null,"2020-08-23","2020-08-23",null,null,null,null,{"$f":"IF(LEN(F36)+LEN(H36)>0,IF(LEN(H36)>0,(HOUR(F36-E36)+MINUTE(F36-E36)/60)+(HOUR(H36-G36)+MINUTE(H36-G36)/60),(HOUR(F36-E36)+MINUTE(F36-E36)/60)),IF(Parameter!$F$29=1,J36,IF(T36=\"\",0,J36)))","v":0},null,null,null,null,null,null,null,null,{"$f":"IF(I36>J36,I36-J36,0)","v":0},{"$f":"IF(C36<=TODAY(),IF(I36<J36,J36-I36,0),0)","v":0},null,null,null,null,null,null,null,null,null,null,null,null,null,{"$f":"IF(AF36<>\"\",IF(E36<>\"\",ABS(24*60*(E36-AF36)),ABS(24*60*(G36-AF36))),0)","v":0},{"$f":"COUNTA(AF36,AI36,AK36,AM36)","v":0},null,{"$f":"IF(AI36<>\"\",IF(H36<>\"\",ABS(24*60*(H36-AI36)),ABS(24*60*(F36-AI36))),0)","v":0},null,{"$f":"IF(AK36<>\"\",IF(E36<>\"\",ABS(24*60*(E36-AK36)),ABS(24*60*(G36-AK36))),0)","v":0},null,{"$f":"IF(AM36<>\"\",IF(H36<>\"\",ABS(24*60*(H36-AM36)),ABS(24*60*(F36-AM36))),0)","v":0},null,null,{"$f":"AQ35+R36-S36","v":0}]
[null,null,"2020-08-24","2020-08-24",null,null,null,null,{"$f":"IF(LEN(F37)+LEN(H37)>0,IF(LEN(H37)>0,(HOUR(F37-E37)+MINUTE(F37-E37)/60)+(HOUR(H37-G37)+MINUTE(H37-G37)/60),(HOUR(F37-E37)+MINUTE(F37-E37)/60)),IF(Parameter!$F$29=1,J37,IF(T37=\"\",0,J37)))","v":0},null,null,null,null,null,null,null,null,{"$f":"IF(I37>J37,I37-J37,0)","v":0},{"$f":"IF(C37<=TODAY(),IF(I37<J37,J37-I37,0),0)","v":0},null,null,null,null,null,null,null,null,null,null,null,null,null,{"$f":"IF(AF37<>\"\",IF(E37<>\"\",ABS(24*60*(E37-AF37)),ABS(24*60*(G37-AF37))),0)","v":0},{"$f":"COUNTA(AF37,AI37,AK37,AM37)","v":0},null,{"$f":"IF(AI37<>\"\",IF(H37<>\"\",ABS(24*60*(H37-AI37)),ABS(24*60*(F37-AI37))),0)","v":0},null,{"$f":"IF(AK37<>\"\",IF(E37<>\"\",ABS(24*60*(E37-AK37)),ABS(24*60*(G37-AK37))),0)","v":0},null,{"$f":"IF(AM37<>\"\",IF(H37<>\"\",ABS(24*60*(H37-AM37)),ABS(24*60*(F37-AM37))),0)","v":0},null,null,{"$f":"AQ36+R37-S37","v":0}]
[null,null,"2020-08-25","2020-08-25",null,null,null,null,{"$f":"IF(LEN(F38)+LEN(H38)>0,IF(LEN(H38)>0,(HOUR(F38-E38)+MINUTE(F38-E38)/60)+(HOUR(H38-G38)+MINUTE(H38-G38)/60),(HOUR(F38-E38)+MINUTE(F38-E38)/60)),IF(Parameter!$F$29=1,J38,IF(T38=\"\",0,J38)))","v":0},null,null,null,null,null,null,null,null,{"$f":"IF(I38>J38,I38-J38,0)","v":0},{"$f":"IF(C38<=TODAY(),IF(I38<J38,J38-I38,0),0)","v":0},null,null,null,null,null,null,null,null,null,null,null,null,null,{"$f":"IF(AF38<>\"\",IF(E38<>\"\",ABS(24*60*(E38-AF38)),ABS(24*60*(G38-AF38))),0)","v":0},{"$f":"COUNTA(AF38,AI38,AK38,AM38)","v":0},null,{"$f":"IF(AI38<>\"\",IF(H38<>\"\",ABS(24*60*(H38-AI38)),ABS(24*60*(F38-AI38))),0)","v":0},null,{"$f":"IF(AK38<>\"\",IF(E38<>\"\",ABS(24*60*(E38-AK38)),ABS(24*60*(G38-AK38))),0)","v":0},null,{"$f":"IF(AM38<>\"\",IF(H38<>\"\",ABS(24*60*(H38-AM38)),ABS(24*60*(F38-AM38))),0)","v":0},null,null,{"$f":"AQ37+R38-S38","v":0}]
[null,null,"2020-08-26","2020-08-26",null,null,null,null,{"$f":"IF(LEN(F39)+LEN(H39)>0,IF(LEN(H39)>0,(HOUR(F39-E39)+MINUTE(F39-E39)/60)+(HOUR(H39-G39)+MINUTE(H39-G39)/60),(HOUR(F39-E39)+MINUTE(F39-E39)/60)),IF(Parameter!$F$29=1,J39,IF(T39=\"\",0,J39)))","v":0},null,null,null,null,null,null,null,null,{"$f":"IF(I39>J39,I39-J39,0)","v":0},{"$f":"IF(C39<=TODAY(),IF(I39<J39,J39-I39,0),0)","v":0},null,null,null,null,null,null,null,null,null,null,null,null,null,{"$f":"IF(AF39<>\"\",IF(E39<>\"\",ABS(24*60*(E39-AF39)),ABS(24*60*(G39-AF39))),0)","v":0},{"$f":"COUNTA(AF39,AI39,AK39,AM39)","v":0},null,{"$f":"IF(AI39<>\"\",IF(H39<>\"\",ABS(24*60*(H39-AI39)),ABS(24*60*(F39-AI39))),0)","v":0},null,{"$f":"IF(AK39<>\"\",IF(E39<>\"\",ABS(24*60*(E39-AK39)),ABS(24*60*(G39-AK39))),0)","v":0},null,{"$f":"IF(AM39<>\"\",IF(H39<>\"\",ABS(24*60*(H39-AM39)),ABS(24*60*(F39-AM39))),0)","v":0},null,null,{"$f":"AQ38+R39-S39","v":0}]
[null,null,"2020-08-27","2020-08-27",null,null,null,null,{"$f":"IF(LEN(F40)+LEN(H40)>0,IF(LEN(H40)>0,(HOUR(F40-E40)+MINUTE(F40-E40)/60)+(HOUR(H40-G40)+MINUTE(H40-G40)/60),(HOUR(F40-E40)+MINUTE(F40-E40)/60)),IF(Parameter!$F$29=1,J40,IF(T40=\"\",0,J40)))","v":0},null,null,null,null,null,null,null,null,{"$f":"IF(I40>J40,I40-J40,0)","v":0},{"$f":"IF(C40<=TODAY(),IF(I40<J40,J40-I40,0),0)","v":0},null,null,null,null,null,null,null,null,null,null,null,null,null,{"$f":"IF(AF40<>\"\",IF(E40<>\"\",ABS(24*60*(E40-AF40)),ABS(24*60*(G40-AF40))),0)","v":0},{"$f":"COUNTA(AF40,AI40,AK40,AM40)","v":0},null,{"$f":"IF(AI40<>\"\",IF(H40<>\"\",ABS(24*60*(H40-AI40)),ABS(24*60*(F40-AI40))),0)","v":0},null,{"$f":"IF(AK40<>\"\",IF(E40<>\"\",ABS(24*60*(E40-AK40)),ABS(24*60*(G40-AK40))),0)","v":0},null,{"$f":"IF(AM40<>\"\",IF(H40<>\"\",ABS(24*60*(H40-AM40)),ABS(24*60*(F40-AM40))),0)","v":0},null,null,{"$f":"AQ39+R40-S40","v":0}]
[null,null,"2020-08-28","2020-08-28",null,null,null,null,{"$f":"IF(LEN(F41)+LEN(H41)>0,IF(LEN(H41)>0,(HOUR(F41-E41)+MINUTE(F41-E41)/60)+(HOUR(H41-G41)+MINUTE(H41-G41)/60),(HOUR(F41-E41)+MINUTE(F41-E41)/60)),IF(Parameter!$F$29=1,J41,IF(T41=\"\",0,J41)))","v":0},null,null,null,null,null,null,null,null,{"$f":"IF(I41>J41,I41-J41,0)","v":0},{"$f":"IF(C41<=TODAY(),IF(I41<J41,J41-I41,0),0)","v":0},null,null,null,null,null,null,null,null,null,null,null,null,null,{"$f":"IF(AF41<>\"\",IF(E41<>\"\",ABS(24*60*(E41-AF41)),ABS(24*60*(G41-AF41))),0)","v":0},{"$f":"COUNTA(AF41,AI41,AK41,AM41)","v":0},null,{"$f":"IF(AI41<>\"\",IF(H41<>\"\",ABS(24*60*(H41-AI41)),ABS(24*60*(F41-AI41))),0)","v":0},null,{"$f":"IF(AK41<>\"\",IF(E41<>\"\",ABS(24*60*(E41-AK41)),ABS(24*60*(G41-AK41))),0)","v":0},null,{"$f":"IF(AM41<>\"\",IF(H41<>\"\",ABS(24*60*(H41-AM41)),ABS(24*60*(F41-AM41))),0)","v":0},null,null,{"$f":"AQ40+R41-S41","v":0}]
[null,null,"2020-08-29","2020-08-29",null,null,null,null,{"$f":"IF(LEN(F42)+LEN(H42)>0,IF(LEN(H42)>0,(HOUR(F42-E42)+MINUTE(F42-E42)/60)+(HOUR(H42-G42)+MINUTE(H42-G42)/60),(HOUR(F42-E42)+MINUTE(F42-E42)/60)),IF(Parameter!$F$29=1,J42,IF(T42=\"\",0,J42)))","v":0},null,null,null,null,null,null,null,null,{"$f":"IF(I42>J42,I42-J42,0)","v":0},{"$f":"IF(C42<=TODAY(),IF(I42<J42,J42-I42,0),0)","v":0},null,null,null,null,null,null,null,null,null,null,null,null,null,{"$f":"IF(AF42<>\"\",IF(E42<>\"\",ABS(24*60*(E42-AF42)),ABS(24*60*(G42-AF42))),0)","v":0},{"$f":"COUNTA(AF42,AI42,AK42,AM42)","v":0},null,{"$f":"IF(AI42<>\"\",IF(H42<>\"\",ABS(24*60*(H42-AI42)),ABS(24*60*(F42-AI42))),0)","v":0},null,{"$f":"IF(AK42<>\"\",IF(E42<>\"\",ABS(24*60*(E42-AK42)),ABS(24*60*(G42-AK42))),0)","v":0},null,{"$f":"IF(AM42<>\"\",IF(H42<>\"\",ABS(24*60*(H42-AM42)),ABS(24*60*(F42-AM42))),0)","v":0},null,null,{"$f":"AQ41+R42-S42","v":0}]
[null,null,{"$f":"IF(MONTH(C14)<>2,IF(MONTH(C42+1)>MONTH(C42),\"\",C42+1),\"\")","v":"2020-08-30"},"2020-08-30",null,null,null,null,{"$f":"IF(LEN(F43)+LEN(H43)>0,IF(LEN(H43)>0,(HOUR(F43-E43)+MINUTE(F43-E43)/60)+(HOUR(H43-G43)+MINUTE(H43-G43)/60),(HOUR(F43-E43)+MINUTE(F43-E43)/60)),IF(Parameter!$F$29=1,J43,IF(T43=\"\",0,J43)))","v":0},null,null,null,null,null,null,null,null,{"$f":"IF(I43>J43,I43-J43,0)","v":0},{"$f":"IF(C43<=TODAY(),IF(I43<J43,J43-I43,0),0)","v":0},null,null,null,null,null,null,null,null,null,null,null,null,null,{"$f":"IF(AF43<>\"\",IF(E43<>\"\",ABS(24*60*(E43-AF43)),ABS(24*60*(G43-AF43))),0)","v":0},{"$f":"COUNTA(AF43,AI43,AK43,AM43)","v":0},null,{"$f":"IF(AI43<>\"\",IF(H43<>\"\",ABS(24*60*(H43-AI43)),ABS(24*60*(F43-AI43))),0)","v":0},null,{"$f":"IF(AK43<>\"\",IF(E43<>\"\",ABS(24*60*(E43-AK43)),ABS(24*60*(G43-AK43))),0)","v":0},null,{"$f":"IF(AM43<>\"\",IF(H43<>\"\",ABS(24*60*(H43-AM43)),ABS(24*60*(F43-AM43))),0)","v":0},null,null,{"$f":"AQ42+R43-S43","v":0}]
[null,null,{"$f":"IF(MONTH(C14)<>2,IF(MONTH(C43+1)>MONTH(C43),\"\",C43+1),\"\")","v":"2020-08-31"},"2020-08-31",null,null,null,null,{"$f":"IF(LEN(F44)+LEN(H44)>0,IF(LEN(H44)>0,(HOUR(F44-E44)+MINUTE(F44-E44)/60)+(HOUR(H44-G44)+MINUTE(H44-G44)/60),(HOUR(F44-E44)+MINUTE(F44-E44)/60)),IF(Parameter!$F$29=1,J44,IF(T44=\"\",0,J44)))","v":0},null,null,null,null,null,null,null,null,{"$f":"IF(I44>J44,I44-J44,0)","v":0},{"$f":"IF(C44<=TODAY(),IF(I44<J44,J44-I44,0),0)","v":0},null,null,null,null,null,null,null,null,null,null,null,null,null,{"$f":"IF(AF44<>\"\",IF(E44<>\"\",ABS(24*60*(E44-AF44)),ABS(24*60*(G44-AF44))),0)","v":0},{"$f":"COUNTA(AF44,AI44,AK44,AM44)","v":0},null,{"$f":"IF(AI44<>\"\",IF(H44<>\"\",ABS(24*60*(H44-AI44)),ABS(24*60*(F44-AI44))),0)","v":0},null,{"$f":"IF(AK44<>\"\",IF(E44<>\"\",ABS(24*60*(E44-AK44)),ABS(24*60*(G44-AK44))),0)","v":0},null,{"$f":"IF(AM44<>\"\",IF(H44<>\"\",ABS(24*60*(H44-AM44)),ABS(24*60*(F44-AM44))),0)","v":0},null,null,{"$f":"AQ43+R44-S44","v":0}]
[null,null,null,null,null,null,null,"Summe:",{"$f":"ROUND(SUM(I14:I44),2)","v":0},{"$f":"ROUND(SUM(J13:J44),2)","v":0},{"$f":"SUM(K14:K44)","v":0},0,0,0,0,0,0,{"$f":"ROUND(SUM(R14:R44),2)","v":0},{"$f":"ROUND(SUM(S14:S44),2)","v":0},{"$f":"IF(COUNTA(T14:T44)=0,\"\",\"/U:\" & COUNTIF(T14:T44,\"u\")&\"/K:\" & COUNTIF(T14:T44,\"k\")&\"/Rest:\" & COUNTA(T14:T44)-COUNTIF(T14:T44,\"u\")-COUNTIF(T14:T44,\"k\"))","v":""},null,null,"Kontrollsummen:",null,null,null,null,null,null,null,null,null,null,null,null,null,null,null,null,null,null,null,null,{"$f":"SUM(AR14:AR44)","v":0},0,0,0,null,0,0,null,"Durchschnitt"]
[null,null,null,null,null,null,null,null,null,null,null,null,null,null,null,null,null,{"$f":"ROUND(R45-S45,2)","v":0},null,"Monatssaldo",null,null,{"$f":"\"IST-Stunden \"&ISTsumme&\" - SOLL-Stunden \"&SOLLsumme&\" =\"","v":"IST-Stunden 0 - SOLL-Stunden 0 ="},null,null,{"$f":"ISTsumme-SOLLsumme","v":0},null,null,null,null,null,null,null,null,null,null,null,null,null,null,null,null,null,null,null,null,null,null,null,null,null,{"$f":"IFERROR(SUM(AZ14:AZ44)/COUNTA(AZ14:AZ44),\"\")","v":""}]
[null,null,"Über-/Mehrstunden",null,null,{"$f":"ROUND(AT45+AU45,2)","v":0},"korr.Endsaldo inkl.Vorperiode:",null,null,null,null,null,null,null,null,null,null,{"$f":"ROUND(R9+R46,2)+F48","v":0},null,"Endsaldo inkl.Vorperiode",null,null,{"$f":"IF(M45<>0,\"minus automatische Überstunden:\",\"Monatssaldo (Zelle R46):\")","v":"Monatssaldo (Zelle R46):"},null,null,{"$f":"IF(M45<>0,-M45,R46)","v":0}]
[null,null,"Zeitsaldo Korrektur",null,null,{"$f":"ROUND((AS45-AT45),2)","v":0},null,null,null,null,null,null,null,null,null,null,null,null,null,"Auszahlung Gutstunden",null,null,{"$f":"IF(M45<>0,\"=Monatssaldo (Zelle R46):\",\"Differenz =\")","v":"Differenz ="},null,null,{"$f":"IF(M45<>0,(Z46+Z47),ROUND(Z46-Z47,1))","v":0}]
[null,null,"Info Lohn: ",null,null,null,null,null,null,null,null,null,null,null,null,null,null,{"$f":"R47-R48","v":0},null,"Vortrag abzgl.Auszahlg.",null,null,{"$f":"IF(M45<>0,\"Differenz =\",\"\")","v":""},null,null,{"$f":"IF(M45<>0,ROUND(Z48-R46,1),\"\")","v":""}]

{"sheet":"9 SEP","index":11,"n_rows":49,"n_cols":75,"rows_kept":49,"cut":false,"hidden":false,"merged":[[47,14,47,16],[47,17,47,18],[10,50,12,50],[10,44,12,44],[10,45,12,45],[10,46,12,46],[10,47,12,47],[10,48,12,48],[10,49,12,49],[10,14,12,14],[10,15,12,15],[10,16,12,16],[46,6,46,16],[10,10,12,10],[10,42,12,42],[10,12,12,12],[2,2,2,18],[6,26,7,26],[5,22,5,24],[10,51,12,51],[10,43,12,43],[7,16,8,16],[8,17,8,18],[8,4,8,8],[7,14,8,14],[7,15,8,15],[7,10,8,10],[7,11,8,11],[7,12,8,12],[7,13,8,13],[2,30,2,32],[2,34,2,35],[11,34,11,35],[0,22,0,26],[5,27,6,27],[8,26,9,26],[11,23,11,24],[11,25,11,26],[10,22,10,26],[11,22,12,22],[10,13,12,13],[10,19,12,19],[5,2,5,4],[7,2,7,3],[10,3,11,3],[11,6,11,7],[10,8,11,9],[8,2,8,3],[11,4,11,5],[10,4,10,7],[10,2,11,2],[5,5,5,8],[5,17,7,18],[7,4,7,8],[5,10,5,13],[45,8,45,9],[46,19,46,21],[5,16,6,16],[48,2,48,3],[48,4,48,9],[47,10,47,13],[46,2,46,4],[47,2,47,4],[47,6,47,9],[46,17,46,18],[10,11,12,11],[44,19,44,20],[45,17,45,18],[10,20,12,20],[11,17,11,18],[45,19,45,21],[48,22,48,24],[45,22,45,24],[46,22,46,24],[48,17,48,18],[47,19,47,21],[48,19,48,21],[47,22,47,24],[2,73,11,73],[2,74,11,74],[11,37,11,38],[2,69,11,69],[2,70,11,70],[2,71,11,71],[2,72,11,72],[2,37,2,38]]}
[]
[]
[null,null,null,null,null,null,null,null,null,null,null,null,null,null,null,null,null,null,null,null,null,null,null,null,null,null,null,null,null,null,null,null,null,null,null,null,null,null,null,null,null,null,null,null,null,null,null,null,null,null,null,null,null,null,null,null,null,null,null,null,null,null,null,null,null,null,null,null,null,{"$f":"IF(AND(Parameter!B69<>\"\"),Parameter!B69&\" \"&Parameter!E69&\"%\",\"\")","v":"Zuschlag vor DP-Beginn 25%"},{"$f":"IF(AND(Parameter!E70<>\"\",Parameter!F70<>\"\"),Parameter!B70&\" \"&TEXT(Parameter!F70,\"hh:mm\")&\" \"&Parameter!E70&\"%\",\"\")","v":"Zuschlag innerhalb DP \nnach 1.Uhrzeit 19:30 50%"},{"$f":"Parameter!B71&\" \"&TEXT(Parameter!F71,\"hh:mm\")&\" \"&Parameter!E71&\"%\"","v":"Zuschlag innerhalb DP \nnach 2.Uhrzeit 21:00 75%"},{"$f":"Parameter!B72&\" \"&TEXT(Parameter!F72,\"hh:mm\")&\" \"&Parameter!E72&\"%\"","v":"Zuschlag außerhalb DP \nnach 1.Uhrzeit 19:30 100%"},{"$f":"Parameter!B73&\" \"&TEXT(Parameter!F73,\"hh:mm\")&\" \"&Parameter!E73&\"%\"","v":"Zuschlag außerhalb DP \nnach 2.Uhrzeit 21:00 125%"},{"$f":"IF(AND(Parameter!B74<>\"\"),Parameter!B74&\" \"&Parameter!E74&\"%\",\"\")","v":"Zuschlag nach DP-Ende 150%"}]
[]
[]
[null,null,"Monat",null,null,{"$f":"MonatsErster+244","v":"2020-09-01"},null,null,null,null,"täglich",null,null,null,"So/Feier","Woche",{"$f":"IF(LEFT(Parameter!J62,1)=\"1\",\"Manuell\",\"Morgen Zeit\")","v":"Manuell"},"Vortrag\nVormonat"]
[]
[null,null,"MitarbeitNr.",null,{"$f":"IF('1 JAN'!E8<>\"\",'1 JAN'!E8,\"\")","v":""},null,null,null,null,null,{"$f":"Parameter!Q50","v":">21:00   100% Üh   "},{"$f":"Parameter!Q52","v":">19:30   50% Üh   "},{"$f":"Parameter!Q54","v":">9h                 50% Üh   "},{"$f":"Parameter!Q56","v":"> Soll-h bis 9 Std.                    50% Üh   "},{"$f":"Parameter!Q58","v":"So/Feiert 100% Üh   "},{"$f":"Parameter!Q60","v":">39h      100% Üh   "},{"$f":"Parameter!Q62","v":"manuell    50% Mh   "}]
[null,null,"Name:",null,{"$f":"IF('1 JAN'!E9<>\"\",'1 JAN'!E9,\"\")","v":""},null,null,null,null,null,null,null,null,null,null,null,null,{"$f":"IF(Parameter!F34=TRUE,'8 AUG'!R49:S49,0)","v":0}]
[null,null,null,{"$f":"IF(D16=\"Fr\",\"JA\",\"\")","v":""}]
[null,null,"Datum","Tag","tatsächliche Arbeitszeit",null,null,null," Gesamt\nStunden",null,{"$f":"MID(Parameter!F50,3,99)","v":"Grund-Stunde ZA - Zuschlag auszahlen"},{"$f":"MID(Parameter!F52,3,99)","v":"Grund-Stunde ZA - Zuschlag auszahlen"},{"$f":"MID(Parameter!F54,3,99)","v":"Grund-Stunde ZA - Zuschlag auszahlen"},{"$f":"MID(Parameter!F56,3,99)","v":"Grund-Stunde ZA - Zuschlag auszahlen"},{"$f":"MID(Parameter!F58,3,99)","v":"Grund-Stunde ZA - Zuschlag auszahlen"},{"$f":"MID(Parameter!F60,3,99)","v":"Grund-Stunde ZA - Zuschlag auszahlen"},{"$f":"MID(Parameter!F62,3,99)","v":"Grund-Stunde ZA - Zuschlag auszahlen"},"Gut-","Minus-"," Urlaub\nKrank\n\nU oder K \nmachen","Feiertag\n\nF-ix\nB-ewegl.",null,{"$f":"IF(AND(UPPER(Parameter!G68=\"AKTIV\"),UPPER(Parameter!R69=\"AKTIV\")),\"Dienstplan-Vorschlag übernehmen\",IF(UPPER(Parameter!G68=\"AKTIV\"),\"Dienstplan\",\"Manuelle Zeiterfassung\"))","v":"Manuelle Zeiterfassung"},null,null,null,null,null,null,null,null,null,null,null,null,null,null,null,null,null,null,null,"Aktueller\nTages\nSaldo","Summe Grundstunden\nim Zeitsaldo","Summe \nZuschlag \nZeitsaldo \nerhöhend","Summe Grundstunden\nzur Auszahlung","Summe \nZuschlag\nzur Auszahlung","Korrigierter Tagessaldo","Korrigierte \nTages IST-Std","Differenz SOLL-Std zu IST-Std inkl. Zeitsaldo Korrekturen","Tagesstunden + sonntags Summe Wochen-\nStunden","Wochen\nsumme \n(korrigiert)"]
[null,null,null,null,"Vormittag",null,"Nachmittag",null,null,null,null,null,null,null,null,null,null,"Stunden",null,null,null,null,{"$f":"IF(UPPER(Parameter!G68)=\"AKTIV\",\"Manuelle Zeiten in Spalte W sind monatlich manuell in die Spalten E-H zu übernehmen\",\"Begründung manuelle Zeiterfassung\")","v":"Begründung manuelle Zeiterfassung"},"Vormittag",null,"Nachmittag"]
[null,"OK",null,null,"von","bis","von","bis","Ist","Soll",null,null,null,null,null,null,null,"+","-",null,null,null,null,"von","bis","von","bis",null,null,null,"Anmerkung","Internet AN Vorm.","Differenz","Anzahl Internetzeiten","Internet AB Vorm","Differenz","Internet AN Nachm.","Differenz","Internet AB Nachm.","Differenz",null,null,null,null,null,null,null,null,null,null,null,null,null,null,null,null,null,null,null,null,null,null,null,null,null,null,null,null,null,{"$f":"SUM(BR14:BR44)","v":0},0,0,0,0,0]
[null,null,{"$f":"DATE('1 JAN'!G2,9,1)","v":"2020-09-01"},{"$f":"C14","v":"2020-09-01"},null,null,null,null,{"$f":"IF(LEN(F14)+LEN(H14)>0,IF(LEN(H14)>0,(HOUR(F14-E14)+MINUTE(F14-E14)/60)+(HOUR(H14-G14)+MINUTE(H14-G14)/60),(HOUR(F14-E14)+MINUTE(F14-E14)/60)),IF(Parameter!$F$29=1,J14,IF(T14=\"\",0,J14)))","v":0},null,null,null,null,null,null,null,null,{"$f":"IF(I14>J14,I14-J14,0)","v":0},{"$f":"IF(C14<=TODAY(),IF(I14<J14,J14-I14,0),0)","v":0},null,null,null,null,null,null,null,null,null,null,null,null,null,{"$f":"IF(AF14<>\"\",IF(E14<>\"\",ABS(24*60*(E14-AF14)),ABS(24*60*(G14-AF14))),0)","v":0},{"$f":"COUNTA(AF14,AI14,AK14,AM14)","v":0},null,{"$f":"IF(AI14<>\"\",IF(H14<>\"\",ABS(24*60*(H14-AI14)),ABS(24*60*(F14-AI14))),0)","v":0},null,{"$f":"IF(AK14<>\"\",IF(E14<>\"\",ABS(24*60*(E14-AK14)),ABS(24*60*(G14-AK14))),0)","v":0},null,{"$f":"IF(AM14<>\"\",IF(H14<>\"\",ABS(24*60*(H14-AM14)),ABS(24*60*(F14-AM14))),0)","v":0},null,null,{"$f":"R9+R14-S14","v":0}]
[null,null,{"$f":"IF(MONTH(C14+1)>MONTH(C14),\"\",C14+1)","v":"2020-09-02"},"2020-09-02",null,null,null,null,{"$f":"IF(LEN(F15)+LEN(H15)>0,IF(LEN(H15)>0,(HOUR(F15-E15)+MINUTE(F15-E15)/60)+(HOUR(H15-G15)+MINUTE(H15-G15)/60),(HOUR(F15-E15)+MINUTE(F15-E15)/60)),IF(Parameter!$F$29=1,J15,IF(T15=\"\",0,J15)))","v":0},null,null,null,null,null,null,null,null,{"$f":"IF(I15>J15,I15-J15,0)","v":0},{"$f":"IF(C15<=TODAY(),IF(I15<J15,J15-I15,0),0)","v":0},null,null,null,null,null,null,null,null,null,null,null,null,null,{"$f":"IF(AF15<>\"\",IF(E15<>\"\",ABS(24*60*(E15-AF15)),ABS(24*60*(G15-AF15))),0)","v":0},{"$f":"COUNTA(AF15,AI15,AK15,AM15)","v":0},null,{"$f":"IF(AI15<>\"\",IF(H15<>\"\",ABS(24*60*(H15-AI15)),ABS(24*60*(F15-AI15))),0)","v":0},null,{"$f":"IF(AK15<>\"\",IF(E15<>\"\",ABS(24*60*(E15-AK15)),ABS(24*60*(G15-AK15))),0)","v":0},null,{"$f":"IF(AM15<>\"\",IF(H15<>\"\",ABS(24*60*(H15-AM15)),ABS(24*60*(F15-AM15))),0)","v":0},null,null,{"$f":"AQ14+R15-S15","v":0}]
[null,null,"2020-09-03","2020-09-03",null,null,null,null,{"$f":"IF(LEN(F16)+LEN(H16)>0,IF(LEN(H16)>0,(HOUR(F16-E16)+MINUTE(F16-E16)/60)+(HOUR(H16-G16)+MINUTE(H16-G16)/60),(HOUR(F16-E16)+MINUTE(F16-E16)/60)),IF(Parameter!$F$29=1,J16,IF(T16=\"\",0,J16)))","v":0},null,null,null,null,null,null,null,null,{"$f":"IF(I16>J16,I16-J16,0)","v":0},{"$f":"IF(C16<=TODAY(),IF(I16<J16,J16-I16,0),0)","v":0},null,null,null,null,null,null,null,null,null,null,null,null,null,{"$f":"IF(AF16<>\"\",IF(E16<>\"\",ABS(24*60*(E16-AF16)),ABS(24*60*(G16-AF16))),0)","v":0},{"$f":"COUNTA(AF16,AI16,AK16,AM16)","v":0},null,{"$f":"IF(AI16<>\"\",IF(H16<>\"\",ABS(24*60*(H16-AI16)),ABS(24*60*(F16-AI16))),0)","v":0},null,{"$f":"IF(AK16<>\"\",IF(E16<>\"\",ABS(24*60*(E16-AK16)),ABS(24*60*(G16-AK16))),0)","v":0},null,{"$f":"IF(AM16<>\"\",IF(H16<>\"\",ABS(24*60*(H16-AM16)),ABS(24*60*(F16-AM16))),0)","v":0},null,null,{"$f":"AQ15+R16-S16","v":0}]
[null,null,"2020-09-04","2020-09-04",null,null,null,null,{"$f":"IF(LEN(F17)+LEN(H17)>0,IF(LEN(H17)>0,(HOUR(F17-E17)+MINUTE(F17-E17)/60)+(HOUR(H17-G17)+MINUTE(H17-G17)/60),(HOUR(F17-E17)+MINUTE(F17-E17)/60)),IF(Parameter!$F$29=1,J17,IF(T17=\"\",0,J17)))","v":0},null,null,null,null,null,null,null,null,{"$f":"IF(I17>J17,I17-J17,0)","v":0},{"$f":"IF(C17<=TODAY(),IF(I17<J17,J17-I17,0),0)","v":0},null,null,null,null,null,null,null,null,null,null,null,null,null,{"$f":"IF(AF17<>\"\",IF(E17<>\"\",ABS(24*60*(E17-AF17)),ABS(24*60*(G17-AF17))),0)","v":0},{"$f":"COUNTA(AF17,AI17,AK17,AM17)","v":0},null,{"$f":"IF(AI17<>\"\",IF(H17<>\"\",ABS(24*60*(H17-AI17)),ABS(24*60*(F17-AI17))),0)","v":0},null,{"$f":"IF(AK17<>\"\",IF(E17<>\"\",ABS(24*60*(E17-AK17)),ABS(24*60*(G17-AK17))),0)","v":0},null,{"$f":"IF(AM17<>\"\",IF(H17<>\"\",ABS(24*60*(H17-AM17)),ABS(24*60*(F17-AM17))),0)","v":0},null,null,{"$f":"AQ16+R17-S17","v":0}]
[null,null,"2020-09-05","2020-09-05",null,null,null,null,{"$f":"IF(LEN(F18)+LEN(H18)>0,IF(LEN(H18)>0,(HOUR(F18-E18)+MINUTE(F18-E18)/60)+(HOUR(H18-G18)+MINUTE(H18-G18)/60),(HOUR(F18-E18)+MINUTE(F18-E18)/60)),IF(Parameter!$F$29=1,J18,IF(T18=\"\",0,J18)))","v":0},null,null,null,null,null,null,null,null,{"$f":"IF(I18>J18,I18-J18,0)","v":0},{"$f":"IF(C18<=TODAY(),IF(I18<J18,J18-I18,0),0)","v":0},null,null,null,null,null,null,null,null,null,null,null,null,null,{"$f":"IF(AF18<>\"\",IF(E18<>\"\",ABS(24*60*(E18-AF18)),ABS(24*60*(G18-AF18))),0)","v":0},{"$f":"COUNTA(AF18,AI18,AK18,AM18)","v":0},null,{"$f":"IF(AI18<>\"\",IF(H18<>\"\",ABS(24*60*(H18-AI18)),ABS(24*60*(F18-AI18))),0)","v":0},null,{"$f":"IF(AK18<>\"\",IF(E18<>\"\",ABS(24*60*(E18-AK18)),ABS(24*60*(G18-AK18))),0)","v":0},null,{"$f":"IF(AM18<>\"\",IF(H18<>\"\",ABS(24*60*(H18-AM18)),ABS(24*60*(F18-AM18))),0)","v":0},null,null,{"$f":"AQ17+R18-S18","v":0}]
[null,null,"2020-09-06","2020-09-06",null,null,null,null,{"$f":"IF(LEN(F19)+LEN(H19)>0,IF(LEN(H19)>0,(HOUR(F19-E19)+MINUTE(F19-E19)/60)+(HOUR(H19-G19)+MINUTE(H19-G19)/60),(HOUR(F19-E19)+MINUTE(F19-E19)/60)),IF(Parameter!$F$29=1,J19,IF(T19=\"\",0,J19)))","v":0},null,null,null,null,null,null,null,null,{"$f":"IF(I19>J19,I19-J19,0)","v":0},{"$f":"IF(C19<=TODAY(),IF(I19<J19,J19-I19,0),0)","v":0},null,null,null,null,null,null,null,null,null,null,null,null,null,{"$f":"IF(AF19<>\"\",IF(E19<>\"\",ABS(24*60*(E19-AF19)),ABS(24*60*(G19-AF19))),0)","v":0},{"$f":"COUNTA(AF19,AI19,AK19,AM19)","v":0},null,{"$f":"IF(AI19<>\"\",IF(H19<>\"\",ABS(24*60*(H19-AI19)),ABS(24*60*(F19-AI19))),0)","v":0},null,{"$f":"IF(AK19<>\"\",IF(E19<>\"\",ABS(24*60*(E19-AK19)),ABS(24*60*(G19-AK19))),0)","v":0},null,{"$f":"IF(AM19<>\"\",IF(H19<>\"\",ABS(24*60*(H19-AM19)),ABS(24*60*(F19-AM19))),0)","v":0},null,null,{"$f":"AQ18+R19-S19","v":0}]
[null,null,"2020-09-07","2020-09-07",null,null,null,null,{"$f":"IF(LEN(F20)+LEN(H20)>0,IF(LEN(H20)>0,(HOUR(F20-E20)+MINUTE(F20-E20)/60)+(HOUR(H20-G20)+MINUTE(H20-G20)/60),(HOUR(F20-E20)+MINUTE(F20-E20)/60)),IF(Parameter!$F$29=1,J20,IF(T20=\"\",0,J20)))","v":0},null,null,null,null,null,null,null,null,{"$f":"IF(I20>J20,I20-J20,0)","v":0},{"$f":"IF(C20<=TODAY(),IF(I20<J20,J20-I20,0),0)","v":0},null,null,null,null,null,null,null,null,null,null,null,null,null,{"$f":"IF(AF20<>\"\",IF(E20<>\"\",ABS(24*60*(E20-AF20)),ABS(24*60*(G20-AF20))),0)","v":0},{"$f":"COUNTA(AF20,AI20,AK20,AM20)","v":0},null,{"$f":"IF(AI20<>\"\",IF(H20<>\"\",ABS(24*60*(H20-AI20)),ABS(24*60*(F20-AI20))),0)","v":0},null,{"$f":"IF(AK20<>\"\",IF(E20<>\"\",ABS(24*60*(E20-AK20)),ABS(24*60*(G20-AK20))),0)","v":0},null,{"$f":"IF(AM20<>\"\",IF(H20<>\"\",ABS(24*60*(H20-AM20)),ABS(24*60*(F20-AM20))),0)","v":0},null,null,{"$f":"AQ19+R20-S20","v":0}]
[null,null,"2020-09-08","2020-09-08",null,null,null,null,{"$f":"IF(LEN(F21)+LEN(H21)>0,IF(LEN(H21)>0,(HOUR(F21-E21)+MINUTE(F21-E21)/60)+(HOUR(H21-G21)+MINUTE(H21-G21)/60),(HOUR(F21-E21)+MINUTE(F21-E21)/60)),IF(Parameter!$F$29=1,J21,IF(T21=\"\",0,J21)))","v":0},null,null,null,null,null,null,null,null,{"$f":"IF(I21>J21,I21-J21,0)","v":0},{"$f":"IF(C21<=TODAY(),IF(I21<J21,J21-I21,0),0)","v":0},null,null,null,null,null,null,null,null,null,null,null,null,null,{"$f":"IF(AF21<>\"\",IF(E21<>\"\",ABS(24*60*(E21-AF21)),ABS(24*60*(G21-AF21))),0)","v":0},{"$f":"COUNTA(AF21,AI21,AK21,AM21)","v":0},null,{"$f":"IF(AI21<>\"\",IF(H21<>\"\",ABS(24*60*(H21-AI21)),ABS(24*60*(F21-AI21))),0)","v":0},null,{"$f":"IF(AK21<>\"\",IF(E21<>\"\",ABS(24*60*(E21-AK21)),ABS(24*60*(G21-AK21))),0)","v":0},null,{"$f":"IF(AM21<>\"\",IF(H21<>\"\",ABS(24*60*(H21-AM21)),ABS(24*60*(F21-AM21))),0)","v":0},null,null,{"$f":"AQ20+R21-S21","v":0}]
[null,null,"2020-09-09","2020-09-09",null,null,null,null,{"$f":"IF(LEN(F22)+LEN(H22)>0,IF(LEN(H22)>0,(HOUR(F22-E22)+MINUTE(F22-E22)/60)+(HOUR(H22-G22)+MINUTE(H22-G22)/60),(HOUR(F22-E22)+MINUTE(F22-E22)/60)),IF(Parameter!$F$29=1,J22,IF(T22=\"\",0,J22)))","v":0},null,null,null,null,null,null,null,null,{"$f":"IF(I22>J22,I22-J22,0)","v":0},{"$f":"IF(C22<=TODAY(),IF(I22<J22,J22-I22,0),0)","v":0},null,null,null,null,null,null,null,null,null,null,null,null,null,{"$f":"IF(AF22<>\"\",IF(E22<>\"\",ABS(24*60*(E22-AF22)),ABS(24*60*(G22-AF22))),0)","v":0},{"$f":"COUNTA(AF22,AI22,AK22,AM22)","v":0},null,{"$f":"IF(AI22<>\"\",IF(H22<>\"\",ABS(24*60*(H22-AI22)),ABS(24*60*(F22-AI22))),0)","v":0},null,{"$f":"IF(AK22<>\"\",IF(E22<>\"\",ABS(24*60*(E22-AK22)),ABS(24*60*(G22-AK22))),0)","v":0},null,{"$f":"IF(AM22<>\"\",IF(H22<>\"\",ABS(24*60*(H22-AM22)),ABS(24*60*(F22-AM22))),0)","v":0},null,null,{"$f":"AQ21+R22-S22","v":0}]
[null,null,"2020-09-10","2020-09-10",null,null,null,null,{"$f":"IF(LEN(F23)+LEN(H23)>0,IF(LEN(H23)>0,(HOUR(F23-E23)+MINUTE(F23-E23)/60)+(HOUR(H23-G23)+MINUTE(H23-G23)/60),(HOUR(F23-E23)+MINUTE(F23-E23)/60)),IF(Parameter!$F$29=1,J23,IF(T23=\"\",0,J23)))","v":0},null,null,null,null,null,null,null,null,{"$f":"IF(I23>J23,I23-J23,0)","v":0},{"$f":"IF(C23<=TODAY(),IF(I23<J23,J23-I23,0),0)","v":0},null,null,null,null,null,null,null,null,null,null,null,null,null,{"$f":"IF(AF23<>\"\",IF(E23<>\"\",ABS(24*60*(E23-AF23)),ABS(24*60*(G23-AF23))),0)","v":0},{"$f":"COUNTA(AF23,AI23,AK23,AM23)","v":0},null,{"$f":"IF(AI23<>\"\",IF(H23<>\"\",ABS(24*60*(H23-AI23)),ABS(24*60*(F23-AI23))),0)","v":0},null,{"$f":"IF(AK23<>\"\",IF(E23<>\"\",ABS(24*60*(E23-AK23)),ABS(24*60*(G23-AK23))),0)","v":0},null,{"$f":"IF(AM23<>\"\",IF(H23<>\"\",ABS(24*60*(H23-AM23)),ABS(24*60*(F23-AM23))),0)","v":0},null,null,{"$f":"AQ22+R23-S23","v":0}]
[null,null,"2020-09-11","2020-09-11",null,null,null,null,{"$f":"IF(LEN(F24)+LEN(H24)>0,IF(LEN(H24)>0,(HOUR(F24-E24)+MINUTE(F24-E24)/60)+(HOUR(H24-G24)+MINUTE(H24-G24)/60),(HOUR(F24-E24)+MINUTE(F24-E24)/60)),IF(Parameter!$F$29=1,J24,IF(T24=\"\",0,J24)))","v":0},null,null,null,null,null,null,null,null,{"$f":"IF(I24>J24,I24-J24,0)","v":0},{"$f":"IF(C24<=TODAY(),IF(I24<J24,J24-I24,0),0)","v":0},null,null,null,null,null,null,null,null,null,null,null,null,null,{"$f":"IF(AF24<>\"\",IF(E24<>\"\",ABS(24*60*(E24-AF24)),ABS(24*60*(G24-AF24))),0)","v":0},{"$f":"COUNTA(AF24,AI24,AK24,AM24)","v":0},null,{"$f":"IF(AI24<>\"\",IF(H24<>\"\",ABS(24*60*(H24-AI24)),ABS(24*60*(F24-AI24))),0)","v":0},null,{"$f":"IF(AK24<>\"\",IF(E24<>\"\",ABS(24*60*(E24-AK24)),ABS(24*60*(G24-AK24))),0)","v":0},null,{"$f":"IF(AM24<>\"\",IF(H24<>\"\",ABS(24*60*(H24-AM24)),ABS(24*60*(F24-AM24))),0)","v":0},null,null,{"$f":"AQ23+R24-S24","v":0}]
[null,null,"2020-09-12","2020-09-12",null,null,null,null,{"$f":"IF(LEN(F25)+LEN(H25)>0,IF(LEN(H25)>0,(HOUR(F25-E25)+MINUTE(F25-E25)/60)+(HOUR(H25-G25)+MINUTE(H25-G25)/60),(HOUR(F25-E25)+MINUTE(F25-E25)/60)),IF(Parameter!$F$29=1,J25,IF(T25=\"\",0,J25)))","v":0},null,null,null,null,null,null,null,null,{"$f":"IF(I25>J25,I25-J25,0)","v":0},{"$f":"IF(C25<=TODAY(),IF(I25<J25,J25-I25,0),0)","v":0},null,null,null,null,null,null,null,null,null,null,null,null,null,{"$f":"IF(AF25<>\"\",IF(E25<>\"\",ABS(24*60*(E25-AF25)),ABS(24*60*(G25-AF25))),0)","v":0},{"$f":"COUNTA(AF25,AI25,AK25,AM25)","v":0},null,{"$f":"IF(AI25<>\"\",IF(H25<>\"\",ABS(24*60*(H25-AI25)),ABS(24*60*(F25-AI25))),0)","v":0},null,{"$f":"IF(AK25<>\"\",IF(E25<>\"\",ABS(24*60*(E25-AK25)),ABS(24*60*(G25-AK25))),0)","v":0},null,{"$f":"IF(AM25<>\"\",IF(H25<>\"\",ABS(24*60*(H25-AM25)),ABS(24*60*(F25-AM25))),0)","v":0},null,null,{"$f":"AQ24+R25-S25","v":0}]
[null,null,"2020-09-13","2020-09-13",null,null,null,null,{"$f":"IF(LEN(F26)+LEN(H26)>0,IF(LEN(H26)>0,(HOUR(F26-E26)+MINUTE(F26-E26)/60)+(HOUR(H26-G26)+MINUTE(H26-G26)/60),(HOUR(F26-E26)+MINUTE(F26-E26)/60)),IF(Parameter!$F$29=1,J26,IF(T26=\"\",0,J26)))","v":0},null,null,null,null,null,null,null,null,{"$f":"IF(I26>J26,I26-J26,0)","v":0},{"$f":"IF(C26<=TODAY(),IF(I26<J26,J26-I26,0),0)","v":0},null,null,null,null,null,null,null,null,null,null,null,null,null,{"$f":"IF(AF26<>\"\",IF(E26<>\"\",ABS(24*60*(E26-AF26)),ABS(24*60*(G26-AF26))),0)","v":0},{"$f":"COUNTA(AF26,AI26,AK26,AM26)","v":0},null,{"$f":"IF(AI26<>\"\",IF(H26<>\"\",ABS(24*60*(H26-AI26)),ABS(24*60*(F26-AI26))),0)","v":0},null,{"$f":"IF(AK26<>\"\",IF(E26<>\"\",ABS(24*60*(E26-AK26)),ABS(24*60*(G26-AK26))),0)","v":0},null,{"$f":"IF(AM26<>\"\",IF(H26<>\"\",ABS(24*60*(H26-AM26)),ABS(24*60*(F26-AM26))),0)","v":0},null,null,{"$f":"AQ25+R26-S26","v":0}]
[null,null,"2020-09-14","2020-09-14",null,null,null,null,{"$f":"IF(LEN(F27)+LEN(H27)>0,IF(LEN(H27)>0,(HOUR(F27-E27)+MINUTE(F27-E27)/60)+(HOUR(H27-G27)+MINUTE(H27-G27)/60),(HOUR(F27-E27)+MINUTE(F27-E27)/60)),IF(Parameter!$F$29=1,J27,IF(T27=\"\",0,J27)))","v":0},null,null,null,null,null,null,null,null,{"$f":"IF(I27>J27,I27-J27,0)","v":0},{"$f":"IF(C27<=TODAY(),IF(I27<J27,J27-I27,0),0)","v":0},null,null,null,null,null,null,null,null,null,null,null,null,null,{"$f":"IF(AF27<>\"\",IF(E27<>\"\",ABS(24*60*(E27-AF27)),ABS(24*60*(G27-AF27))),0)","v":0},{"$f":"COUNTA(AF27,AI27,AK27,AM27)","v":0},null,{"$f":"IF(AI27<>\"\",IF(H27<>\"\",ABS(24*60*(H27-AI27)),ABS(24*60*(F27-AI27))),0)","v":0},null,{"$f":"IF(AK27<>\"\",IF(E27<>\"\",ABS(24*60*(E27-AK27)),ABS(24*60*(G27-AK27))),0)","v":0},null,{"$f":"IF(AM27<>\"\",IF(H27<>\"\",ABS(24*60*(H27-AM27)),ABS(24*60*(F27-AM27))),0)","v":0},null,null,{"$f":"AQ26+R27-S27","v":0}]
[null,null,"2020-09-15","2020-09-15",null,null,null,null,{"$f":"IF(LEN(F28)+LEN(H28)>0,IF(LEN(H28)>0,(HOUR(F28-E28)+MINUTE(F28-E28)/60)+(HOUR(H28-G28)+MINUTE(H28-G28)/60),(HOUR(F28-E28)+MINUTE(F28-E28)/60)),IF(Parameter!$F$29=1,J28,IF(T28=\"\",0,J28)))","v":0},null,null,null,null,null,null,null,null,{"$f":"IF(I28>J28,I28-J28,0)","v":0},{"$f":"IF(C28<=TODAY(),IF(I28<J28,J28-I28,0),0)","v":0},null,null,null,null,null,null,null,null,null,null,null,null,null,{"$f":"IF(AF28<>\"\",IF(E28<>\"\",ABS(24*60*(E28-AF28)),ABS(24*60*(G28-AF28))),0)","v":0},{"$f":"COUNTA(AF28,AI28,AK28,AM28)","v":0},null,{"$f":"IF(AI28<>\"\",IF(H28<>\"\",ABS(24*60*(H28-AI28)),ABS(24*60*(F28-AI28))),0)","v":0},null,{"$f":"IF(AK28<>\"\",IF(E28<>\"\",ABS(24*60*(E28-AK28)),ABS(24*60*(G28-AK28))),0)","v":0},null,{"$f":"IF(AM28<>\"\",IF(H28<>\"\",ABS(24*60*(H28-AM28)),ABS(24*60*(F28-AM28))),0)","v":0},null,null,{"$f":"AQ27+R28-S28","v":0}]
[null,null,"2020-09-16","2020-09-16",null,null,null,null,{"$f":"IF(LEN(F29)+LEN(H29)>0,IF(LEN(H29)>0,(HOUR(F29-E29)+MINUTE(F29-E29)/60)+(HOUR(H29-G29)+MINUTE(H29-G29)/60),(HOUR(F29-E29)+MINUTE(F29-E29)/60)),IF(Parameter!$F$29=1,J29,IF(T29=\"\",0,J29)))","v":0},null,null,null,null,null,null,null,null,{"$f":"IF(I29>J29,I29-J29,0)","v":0},{"$f":"IF(C29<=TODAY(),IF(I29<J29,J29-I29,0),0)","v":0},null,null,null,null,null,null,null,null,null,null,null,null,null,{"$f":"IF(AF29<>\"\",IF(E29<>\"\",ABS(24*60*(E29-AF29)),ABS(24*60*(G29-AF29))),0)","v":0},{"$f":"COUNTA(AF29,AI29,AK29,AM29)","v":0},null,{"$f":"IF(AI29<>\"\",IF(H29<>\"\",ABS(24*60*(H29-AI29)),ABS(24*60*(F29-AI29))),0)","v":0},null,{"$f":"IF(AK29<>\"\",IF(E29<>\"\",ABS(24*60*(E29-AK29)),ABS(24*60*(G29-AK29))),0)","v":0},null,{"$f":"IF(AM29<>\"\",IF(H29<>\"\",ABS(24*60*(H29-AM29)),ABS(24*60*(F29-AM29))),0)","v":0},null,null,{"$f":"AQ28+R29-S29","v":0}]
[null,null,"2020-09-17","2020-09-17",null,null,null,null,{"$f":"IF(LEN(F30)+LEN(H30)>0,IF(LEN(H30)>0,(HOUR(F30-E30)+MINUTE(F30-E30)/60)+(HOUR(H30-G30)+MINUTE(H30-G30)/60),(HOUR(F30-E30)+MINUTE(F30-E30)/60)),IF(Parameter!$F$29=1,J30,IF(T30=\"\",0,J30)))","v":0},null,null,null,null,null,null,null,null,{"$f":"IF(I30>J30,I30-J30,0)","v":0},{"$f":"IF(C30<=TODAY(),IF(I30<J30,J30-I30,0),0)","v":0},null,null,null,null,null,null,null,null,null,null,null,null,null,{"$f":"IF(AF30<>\"\",IF(E30<>\"\",ABS(24*60*(E30-AF30)),ABS(24*60*(G30-AF30))),0)","v":0},{"$f":"COUNTA(AF30,AI30,AK30,AM30)","v":0},null,{"$f":"IF(AI30<>\"\",IF(H30<>\"\",ABS(24*60*(H30-AI30)),ABS(24*60*(F30-AI30))),0)","v":0},null,{"$f":"IF(AK30<>\"\",IF(E30<>\"\",ABS(24*60*(E30-AK30)),ABS(24*60*(G30-AK30))),0)","v":0},null,{"$f":"IF(AM30<>\"\",IF(H30<>\"\",ABS(24*60*(H30-AM30)),ABS(24*60*(F30-AM30))),0)","v":0},null,null,{"$f":"AQ29+R30-S30","v":0}]
[null,null,"2020-09-18","2020-09-18",null,null,null,null,{"$f":"IF(LEN(F31)+LEN(H31)>0,IF(LEN(H31)>0,(HOUR(F31-E31)+MINUTE(F31-E31)/60)+(HOUR(H31-G31)+MINUTE(H31-G31)/60),(HOUR(F31-E31)+MINUTE(F31-E31)/60)),IF(Parameter!$F$29=1,J31,IF(T31=\"\",0,J31)))","v":0},null,null,null,null,null,null,null,null,{"$f":"IF(I31>J31,I31-J31,0)","v":0},{"$f":"IF(C31<=TODAY(),IF(I31<J31,J31-I31,0),0)","v":0},null,null,null,null,null,null,null,null,null,null,null,null,null,{"$f":"IF(AF31<>\"\",IF(E31<>\"\",ABS(24*60*(E31-AF31)),ABS(24*60*(G31-AF31))),0)","v":0},{"$f":"COUNTA(AF31,AI31,AK31,AM31)","v":0},null,{"$f":"IF(AI31<>\"\",IF(H31<>\"\",ABS(24*60*(H31-AI31)),ABS(24*60*(F31-AI31))),0)","v":0},null,{"$f":"IF(AK31<>\"\",IF(E31<>\"\",ABS(24*60*(E31-AK31)),ABS(24*60*(G31-AK31))),0)","v":0},null,{"$f":"IF(AM31<>\"\",IF(H31<>\"\",ABS(24*60*(H31-AM31)),ABS(24*60*(F31-AM31))),0)","v":0},null,null,{"$f":"AQ30+R31-S31","v":0}]
[null,null,"2020-09-19","2020-09-19",null,null,null,null,{"$f":"IF(LEN(F32)+LEN(H32)>0,IF(LEN(H32)>0,(HOUR(F32-E32)+MINUTE(F32-E32)/60)+(HOUR(H32-G32)+MINUTE(H32-G32)/60),(HOUR(F32-E32)+MINUTE(F32-E32)/60)),IF(Parameter!$F$29=1,J32,IF(T32=\"\",0,J32)))","v":0},null,null,null,null,null,null,null,null,{"$f":"IF(I32>J32,I32-J32,0)","v":0},{"$f":"IF(C32<=TODAY(),IF(I32<J32,J32-I32,0),0)","v":0},null,null,null,null,null,null,null,null,null,null,null,null,null,{"$f":"IF(AF32<>\"\",IF(E32<>\"\",ABS(24*60*(E32-AF32)),ABS(24*60*(G32-AF32))),0)","v":0},{"$f":"COUNTA(AF32,AI32,AK32,AM32)","v":0},null,{"$f":"IF(AI32<>\"\",IF(H32<>\"\",ABS(24*60*(H32-AI32)),ABS(24*60*(F32-AI32))),0)","v":0},null,{"$f":"IF(AK32<>\"\",IF(E32<>\"\",ABS(24*60*(E32-AK32)),ABS(24*60*(G32-AK32))),0)","v":0},null,{"$f":"IF(AM32<>\"\",IF(H32<>\"\",ABS(24*60*(H32-AM32)),ABS(24*60*(F32-AM32))),0)","v":0},null,null,{"$f":"AQ31+R32-S32","v":0}]
[null,null,"2020-09-20","2020-09-20",null,null,null,null,{"$f":"IF(LEN(F33)+LEN(H33)>0,IF(LEN(H33)>0,(HOUR(F33-E33)+MINUTE(F33-E33)/60)+(HOUR(H33-G33)+MINUTE(H33-G33)/60),(HOUR(F33-E33)+MINUTE(F33-E33)/60)),IF(Parameter!$F$29=1,J33,IF(T33=\"\",0,J33)))","v":0},null,null,null,null,null,null,null,null,{"$f":"IF(I33>J33,I33-J33,0)","v":0},{"$f":"IF(C33<=TODAY(),IF(I33<J33,J33-I33,0),0)","v":0},null,null,null,null,null,null,null,null,null,null,null,null,null,{"$f":"IF(AF33<>\"\",IF(E33<>\"\",ABS(24*60*(E33-AF33)),ABS(24*60*(G33-AF33))),0)","v":0},{"$f":"COUNTA(AF33,AI33,AK33,AM33)","v":0},null,{"$f":"IF(AI33<>\"\",IF(H33<>\"\",ABS(24*60*(H33-AI33)),ABS(24*60*(F33-AI33))),0)","v":0},null,{"$f":"IF(AK33<>\"\",IF(E33<>\"\",ABS(24*60*(E33-AK33)),ABS(24*60*(G33-AK33))),0)","v":0},null,{"$f":"IF(AM33<>\"\",IF(H33<>\"\",ABS(24*60*(H33-AM33)),ABS(24*60*(F33-AM33))),0)","v":0},null,null,{"$f":"AQ32+R33-S33","v":0}]
[null,null,"2020-09-21","2020-09-21",null,null,null,null,{"$f":"IF(LEN(F34)+LEN(H34)>0,IF(LEN(H34)>0,(HOUR(F34-E34)+MINUTE(F34-E34)/60)+(HOUR(H34-G34)+MINUTE(H34-G34)/60),(HOUR(F34-E34)+MINUTE(F34-E34)/60)),IF(Parameter!$F$29=1,J34,IF(T34=\"\",0,J34)))","v":0},null,null,null,null,null,null,null,null,{"$f":"IF(I34>J34,I34-J34,0)","v":0},{"$f":"IF(C34<=TODAY(),IF(I34<J34,J34-I34,0),0)","v":0},null,null,null,null,null,null,null,null,null,null,null,null,null,{"$f":"IF(AF34<>\"\",IF(E34<>\"\",ABS(24*60*(E34-AF34)),ABS(24*60*(G34-AF34))),0)","v":0},{"$f":"COUNTA(AF34,AI34,AK34,AM34)","v":0},null,{"$f":"IF(AI34<>\"\",IF(H34<>\"\",ABS(24*60*(H34-AI34)),ABS(24*60*(F34-AI34))),0)","v":0},null,{"$f":"IF(AK34<>\"\",IF(E34<>\"\",ABS(24*60*(E34-AK34)),ABS(24*60*(G34-AK34))),0)","v":0},null,{"$f":"IF(AM34<>\"\",IF(H34<>\"\",ABS(24*60*(H34-AM34)),ABS(24*60*(F34-AM34))),0)","v":0},null,null,{"$f":"AQ33+R34-S34","v":0}]
[null,null,"2020-09-22","2020-09-22",null,null,null,null,{"$f":"IF(LEN(F35)+LEN(H35)>0,IF(LEN(H35)>0,(HOUR(F35-E35)+MINUTE(F35-E35)/60)+(HOUR(H35-G35)+MINUTE(H35-G35)/60),(HOUR(F35-E35)+MINUTE(F35-E35)/60)),IF(Parameter!$F$29=1,J35,IF(T35=\"\",0,J35)))","v":0},null,null,null,null,null,null,null,null,{"$f":"IF(I35>J35,I35-J35,0)","v":0},{"$f":"IF(C35<=TODAY(),IF(I35<J35,J35-I35,0),0)","v":0},null,null,null,null,null,null,null,null,null,null,null,null,null,{"$f":"IF(AF35<>\"\",IF(E35<>\"\",ABS(24*60*(E35-AF35)),ABS(24*60*(G35-AF35))),0)","v":0},{"$f":"COUNTA(AF35,AI35,AK35,AM35)","v":0},null,{"$f":"IF(AI35<>\"\",IF(H35<>\"\",ABS(24*60*(H35-AI35)),ABS(24*60*(F35-AI35))),0)","v":0},null,{"$f":"IF(AK35<>\"\",IF(E35<>\"\",ABS(24*60*(E35-AK35)),ABS(24*60*(G35-AK35))),0)","v":0},null,{"$f":"IF(AM35<>\"\",IF(H35<>\"\",ABS(24*60*(H35-AM35)),ABS(24*60*(F35-AM35))),0)","v":0},null,null,{"$f":"AQ34+R35-S35","v":0}]
[null,null,"2020-09-23","2020-09-23",null,null,null,null,{"$f":"IF(LEN(F36)+LEN(H36)>0,IF(LEN(H36)>0,(HOUR(F36-E36)+MINUTE(F36-E36)/60)+(HOUR(H36-G36)+MINUTE(H36-G36)/60),(HOUR(F36-E36)+MINUTE(F36-E36)/60)),IF(Parameter!$F$29=1,J36,IF(T36=\"\",0,J36)))","v":0},null,null,null,null,null,null,null,null,{"$f":"IF(I36>J36,I36-J36,0)","v":0},{"$f":"IF(C36<=TODAY(),IF(I36<J36,J36-I36,0),0)","v":0},null,null,null,null,null,null,null,null,null,null,null,null,null,{"$f":"IF(AF36<>\"\",IF(E36<>\"\",ABS(24*60*(E36-AF36)),ABS(24*60*(G36-AF36))),0)","v":0},{"$f":"COUNTA(AF36,AI36,AK36,AM36)","v":0},null,{"$f":"IF(AI36<>\"\",IF(H36<>\"\",ABS(24*60*(H36-AI36)),ABS(24*60*(F36-AI36))),0)","v":0},null,{"$f":"IF(AK36<>\"\",IF(E36<>\"\",ABS(24*60*(E36-AK36)),ABS(24*60*(G36-AK36))),0)","v":0},null,{"$f":"IF(AM36<>\"\",IF(H36<>\"\",ABS(24*60*(H36-AM36)),ABS(24*60*(F36-AM36))),0)","v":0},null,null,{"$f":"AQ35+R36-S36","v":0}]
[null,null,"2020-09-24","2020-09-24",null,null,null,null,{"$f":"IF(LEN(F37)+LEN(H37)>0,IF(LEN(H37)>0,(HOUR(F37-E37)+MINUTE(F37-E37)/60)+(HOUR(H37-G37)+MINUTE(H37-G37)/60),(HOUR(F37-E37)+MINUTE(F37-E37)/60)),IF(Parameter!$F$29=1,J37,IF(T37=\"\",0,J37)))","v":0},null,null,null,null,null,null,null,null,{"$f":"IF(I37>J37,I37-J37,0)","v":0},{"$f":"IF(C37<=TODAY(),IF(I37<J37,J37-I37,0),0)","v":0},null,null,null,null,null,null,null,null,null,null,null,null,null,{"$f":"IF(AF37<>\"\",IF(E37<>\"\",ABS(24*60*(E37-AF37)),ABS(24*60*(G37-AF37))),0)","v":0},{"$f":"COUNTA(AF37,AI37,AK37,AM37)","v":0},null,{"$f":"IF(AI37<>\"\",IF(H37<>\"\",ABS(24*60*(H37-AI37)),ABS(24*60*(F37-AI37))),0)","v":0},null,{"$f":"IF(AK37<>\"\",IF(E37<>\"\",ABS(24*60*(E37-AK37)),ABS(24*60*(G37-AK37))),0)","v":0},null,{"$f":"IF(AM37<>\"\",IF(H37<>\"\",ABS(24*60*(H37-AM37)),ABS(24*60*(F37-AM37))),0)","v":0},null,null,{"$f":"AQ36+R37-S37","v":0}]
[null,null,"2020-09-25","2020-09-25",null,null,null,null,{"$f":"IF(LEN(F38)+LEN(H38)>0,IF(LEN(H38)>0,(HOUR(F38-E38)+MINUTE(F38-E38)/60)+(HOUR(H38-G38)+MINUTE(H38-G38)/60),(HOUR(F38-E38)+MINUTE(F38-E38)/60)),IF(Parameter!$F$29=1,J38,IF(T38=\"\",0,J38)))","v":0},null,null,null,null,null,null,null,null,{"$f":"IF(I38>J38,I38-J38,0)","v":0},{"$f":"IF(C38<=TODAY(),IF(I38<J38,J38-I38,0),0)","v":0},null,null,null,null,null,null,null,null,null,null,null,null,null,{"$f":"IF(AF38<>\"\",IF(E38<>\"\",ABS(24*60*(E38-AF38)),ABS(24*60*(G38-AF38))),0)","v":0},{"$f":"COUNTA(AF38,AI38,AK38,AM38)","v":0},null,{"$f":"IF(AI38<>\"\",IF(H38<>\"\",ABS(24*60*(H38-AI38)),ABS(24*60*(F38-AI38))),0)","v":0},null,{"$f":"IF(AK38<>\"\",IF(E38<>\"\",ABS(24*60*(E38-AK38)),ABS(24*60*(G38-AK38))),0)","v":0},null,{"$f":"IF(AM38<>\"\",IF(H38<>\"\",ABS(24*60*(H38-AM38)),ABS(24*60*(F38-AM38))),0)","v":0},null,null,{"$f":"AQ37+R38-S38","v":0}]
[null,null,"2020-09-26","2020-09-26",null,null,null,null,{"$f":"IF(LEN(F39)+LEN(H39)>0,IF(LEN(H39)>0,(HOUR(F39-E39)+MINUTE(F39-E39)/60)+(HOUR(H39-G39)+MINUTE(H39-G39)/60),(HOUR(F39-E39)+MINUTE(F39-E39)/60)),IF(Parameter!$F$29=1,J39,IF(T39=\"\",0,J39)))","v":0},null,null,null,null,null,null,null,null,{"$f":"IF(I39>J39,I39-J39,0)","v":0},{"$f":"IF(C39<=TODAY(),IF(I39<J39,J39-I39,0),0)","v":0},null,null,null,null,null,null,null,null,null,null,null,null,null,{"$f":"IF(AF39<>\"\",IF(E39<>\"\",ABS(24*60*(E39-AF39)),ABS(24*60*(G39-AF39))),0)","v":0},{"$f":"COUNTA(AF39,AI39,AK39,AM39)","v":0},null,{"$f":"IF(AI39<>\"\",IF(H39<>\"\",ABS(24*60*(H39-AI39)),ABS(24*60*(F39-AI39))),0)","v":0},null,{"$f":"IF(AK39<>\"\",IF(E39<>\"\",ABS(24*60*(E39-AK39)),ABS(24*60*(G39-AK39))),0)","v":0},null,{"$f":"IF(AM39<>\"\",IF(H39<>\"\",ABS(24*60*(H39-AM39)),ABS(24*60*(F39-AM39))),0)","v":0},null,null,{"$f":"AQ38+R39-S39","v":0}]
[null,null,"2020-09-27","2020-09-27",null,null,null,null,{"$f":"IF(LEN(F40)+LEN(H40)>0,IF(LEN(H40)>0,(HOUR(F40-E40)+MINUTE(F40-E40)/60)+(HOUR(H40-G40)+MINUTE(H40-G40)/60),(HOUR(F40-E40)+MINUTE(F40-E40)/60)),IF(Parameter!$F$29=1,J40,IF(T40=\"\",0,J40)))","v":0},null,null,null,null,null,null,null,null,{"$f":"IF(I40>J40,I40-J40,0)","v":0},{"$f":"IF(C40<=TODAY(),IF(I40<J40,J40-I40,0),0)","v":0},null,null,null,null,null,null,null,null,null,null,null,null,null,{"$f":"IF(AF40<>\"\",IF(E40<>\"\",ABS(24*60*(E40-AF40)),ABS(24*60*(G40-AF40))),0)","v":0},{"$f":"COUNTA(AF40,AI40,AK40,AM40)","v":0},null,{"$f":"IF(AI40<>\"\",IF(H40<>\"\",ABS(24*60*(H40-AI40)),ABS(24*60*(F40-AI40))),0)","v":0},null,{"$f":"IF(AK40<>\"\",IF(E40<>\"\",ABS(24*60*(E40-AK40)),ABS(24*60*(G40-AK40))),0)","v":0},null,{"$f":"IF(AM40<>\"\",IF(H40<>\"\",ABS(24*60*(H40-AM40)),ABS(24*60*(F40-AM40))),0)","v":0},null,null,{"$f":"AQ39+R40-S40","v":0}]
[null,null,"2020-09-28","2020-09-28",null,null,null,null,{"$f":"IF(LEN(F41)+LEN(H41)>0,IF(LEN(H41)>0,(HOUR(F41-E41)+MINUTE(F41-E41)/60)+(HOUR(H41-G41)+MINUTE(H41-G41)/60),(HOUR(F41-E41)+MINUTE(F41-E41)/60)),IF(Parameter!$F$29=1,J41,IF(T41=\"\",0,J41)))","v":0},null,null,null,null,null,null,null,null,{"$f":"IF(I41>J41,I41-J41,0)","v":0},{"$f":"IF(C41<=TODAY(),IF(I41<J41,J41-I41,0),0)","v":0},null,null,null,null,null,null,null,null,null,null,null,null,null,{"$f":"IF(AF41<>\"\",IF(E41<>\"\",ABS(24*60*(E41-AF41)),ABS(24*60*(G41-AF41))),0)","v":0},{"$f":"COUNTA(AF41,AI41,AK41,AM41)","v":0},null,{"$f":"IF(AI41<>\"\",IF(H41<>\"\",ABS(24*60*(H41-AI41)),ABS(24*60*(F41-AI41))),0)","v":0},null,{"$f":"IF(AK41<>\"\",IF(E41<>\"\",ABS(24*60*(E41-AK41)),ABS(24*60*(G41-AK41))),0)","v":0},null,{"$f":"IF(AM41<>\"\",IF(H41<>\"\",ABS(24*60*(H41-AM41)),ABS(24*60*(F41-AM41))),0)","v":0},null,null,{"$f":"AQ40+R41-S41","v":0}]
[null,null,"2020-09-29","2020-09-29",null,null,null,null,{"$f":"IF(LEN(F42)+LEN(H42)>0,IF(LEN(H42)>0,(HOUR(F42-E42)+MINUTE(F42-E42)/60)+(HOUR(H42-G42)+MINUTE(H42-G42)/60),(HOUR(F42-E42)+MINUTE(F42-E42)/60)),IF(Parameter!$F$29=1,J42,IF(T42=\"\",0,J42)))","v":0},null,null,null,null,null,null,null,null,{"$f":"IF(I42>J42,I42-J42,0)","v":0},{"$f":"IF(C42<=TODAY(),IF(I42<J42,J42-I42,0),0)","v":0},null,null,null,null,null,null,null,null,null,null,null,null,null,{"$f":"IF(AF42<>\"\",IF(E42<>\"\",ABS(24*60*(E42-AF42)),ABS(24*60*(G42-AF42))),0)","v":0},{"$f":"COUNTA(AF42,AI42,AK42,AM42)","v":0},null,{"$f":"IF(AI42<>\"\",IF(H42<>\"\",ABS(24*60*(H42-AI42)),ABS(24*60*(F42-AI42))),0)","v":0},null,{"$f":"IF(AK42<>\"\",IF(E42<>\"\",ABS(24*60*(E42-AK42)),ABS(24*60*(G42-AK42))),0)","v":0},null,{"$f":"IF(AM42<>\"\",IF(H42<>\"\",ABS(24*60*(H42-AM42)),ABS(24*60*(F42-AM42))),0)","v":0},null,null,{"$f":"AQ41+R42-S42","v":0}]
[null,null,{"$f":"IF(MONTH(C14)<>2,IF(MONTH(C42+1)>MONTH(C42),\"\",C42+1),\"\")","v":"2020-09-30"},"2020-09-30",null,null,null,null,{"$f":"IF(LEN(F43)+LEN(H43)>0,IF(LEN(H43)>0,(HOUR(F43-E43)+MINUTE(F43-E43)/60)+(HOUR(H43-G43)+MINUTE(H43-G43)/60),(HOUR(F43-E43)+MINUTE(F43-E43)/60)),IF(Parameter!$F$29=1,J43,IF(T43=\"\",0,J43)))","v":0},null,null,null,null,null,null,null,null,{"$f":"IF(I43>J43,I43-J43,0)","v":0},{"$f":"IF(C43<=TODAY(),IF(I43<J43,J43-I43,0),0)","v":0},null,null,null,null,null,null,null,null,null,null,null,null,null,{"$f":"IF(AF43<>\"\",IF(E43<>\"\",ABS(24*60*(E43-AF43)),ABS(24*60*(G43-AF43))),0)","v":0},{"$f":"COUNTA(AF43,AI43,AK43,AM43)","v":0},null,{"$f":"IF(AI43<>\"\",IF(H43<>\"\",ABS(24*60*(H43-AI43)),ABS(24*60*(F43-AI43))),0)","v":0},null,{"$f":"IF(AK43<>\"\",IF(E43<>\"\",ABS(24*60*(E43-AK43)),ABS(24*60*(G43-AK43))),0)","v":0},null,{"$f":"IF(AM43<>\"\",IF(H43<>\"\",ABS(24*60*(H43-AM43)),ABS(24*60*(F43-AM43))),0)","v":0},null,null,{"$f":"AQ42+R43-S43","v":0}]
[null,null,{"$f":"IF(MONTH(C14)<>2,IF(MONTH(C43+1)>MONTH(C43),\"\",C43+1),\"\")","v":""},"",null,null,null,null,{"$f":"IF(LEN(F44)+LEN(H44)>0,IF(LEN(H44)>0,(HOUR(F44-E44)+MINUTE(F44-E44)/60)+(HOUR(H44-G44)+MINUTE(H44-G44)/60),(HOUR(F44-E44)+MINUTE(F44-E44)/60)),IF(Parameter!$F$29=1,J44,IF(T44=\"\",0,J44)))","v":0},null,null,null,null,null,null,null,null,{"$f":"IF(I44>J44,I44-J44,0)","v":0},{"$f":"IF(C44<=TODAY(),IF(I44<J44,J44-I44,0),0)","v":0},null,null,null,null,null,null,null,null,null,null,null,null,null,{"$f":"IF(AF44<>\"\",IF(E44<>\"\",ABS(24*60*(E44-AF44)),ABS(24*60*(G44-AF44))),0)","v":0},{"$f":"COUNTA(AF44,AI44,AK44,AM44)","v":0},null,{"$f":"IF(AI44<>\"\",IF(H44<>\"\",ABS(24*60*(H44-AI44)),ABS(24*60*(F44-AI44))),0)","v":0},null,{"$f":"IF(AK44<>\"\",IF(E44<>\"\",ABS(24*60*(E44-AK44)),ABS(24*60*(G44-AK44))),0)","v":0},null,{"$f":"IF(AM44<>\"\",IF(H44<>\"\",ABS(24*60*(H44-AM44)),ABS(24*60*(F44-AM44))),0)","v":0},null,null,{"$f":"AQ43+R44-S44","v":0}]
[null,null,null,null,null,null,null,"Summe:",{"$f":"ROUND(SUM(I14:I44),2)","v":0},{"$f":"ROUND(SUM(J13:J44),2)","v":0},{"$f":"SUM(K14:K44)","v":0},0,0,0,0,0,0,{"$f":"ROUND(SUM(R14:R44),2)","v":0},{"$f":"ROUND(SUM(S14:S44),2)","v":0},{"$f":"IF(COUNTA(T14:T44)=0,\"\",\"/U:\" & COUNTIF(T14:T44,\"u\")&\"/K:\" & COUNTIF(T14:T44,\"k\")&\"/Rest:\" & COUNTA(T14:T44)-COUNTIF(T14:T44,\"u\")-COUNTIF(T14:T44,\"k\"))","v":""},null,null,"Kontrollsummen:",null,null,null,null,null,null,null,null,null,null,null,null,null,null,null,null,null,null,null,null,{"$f":"SUM(AR14:AR44)","v":0},0,0,0,null,0,0,null,"Durchschnitt"]
[null,null,null,null,null,null,null,null,null,null,null,null,null,null,null,null,null,{"$f":"ROUND(R45-S45,2)","v":0},null,"Monatssaldo",null,null,{"$f":"\"IST-Stunden \"&ISTsumme&\" - SOLL-Stunden \"&SOLLsumme&\" =\"","v":"IST-Stunden 0 - SOLL-Stunden 0 ="},null,null,{"$f":"ISTsumme-SOLLsumme","v":0},null,null,null,null,null,null,null,null,null,null,null,null,null,null,null,null,null,null,null,null,null,null,null,null,null,{"$f":"IFERROR(SUM(AZ14:AZ44)/COUNTA(AZ14:AZ44),\"\")","v":""}]
[null,null,"Über-/Mehrstunden",null,null,{"$f":"ROUND(AT45+AU45,2)","v":0},"korr.Endsaldo inkl.Vorperiode:",null,null,null,null,null,null,null,null,null,null,{"$f":"ROUND(R9+R46,2)+F48","v":0},null,"Endsaldo inkl.Vorperiode",null,null,{"$f":"IF(M45<>0,\"minus automatische Überstunden:\",\"Monatssaldo (Zelle R46):\")","v":"Monatssaldo (Zelle R46):"},null,null,{"$f":"IF(M45<>0,-M45,R46)","v":0}]
[null,null,"Zeitsaldo Korrektur",null,null,{"$f":"ROUND((AS45-AT45),2)","v":0},null,null,null,null,null,null,null,null,null,null,null,null,null,"Auszahlung Gutstunden",null,null,{"$f":"IF(M45<>0,\"=Monatssaldo (Zelle R46):\",\"Differenz =\")","v":"Differenz ="},null,null,{"$f":"IF(M45<>0,(Z46+Z47),ROUND(Z46-Z47,1))","v":0}]
[null,null,"Info Lohn: ",null,null,null,null,null,null,null,null,null,null,null,null,null,null,{"$f":"R47-R48","v":0},null,"Vortrag abzgl.Auszahlg.",null,null,{"$f":"IF(M45<>0,\"Differenz =\",\"\")","v":""},null,null,{"$f":"IF(M45<>0,ROUND(Z48-R46,1),\"\")","v":""}]

{"sheet":"10 OKT","index":12,"n_rows":49,"n_cols":75,"rows_kept":49,"cut":false,"hidden":false,"merged":[[2,30,2,32],[2,34,2,35],[2,37,2,38],[11,34,11,35],[11,37,11,38],[10,51,12,51],[46,2,46,4],[47,2,47,4],[47,6,47,9],[10,49,12,49],[47,14,47,16],[47,17,47,18],[46,17,46,18],[45,17,45,18],[10,14,12,14],[10,11,12,11],[10,43,12,43],[44,19,44,20],[10,42,12,42],[46,6,46,16],[47,10,47,13],[10,2,11,2],[11,4,11,5],[7,16,8,16],[10,10,12,10],[7,12,8,12],[7,14,8,14],[7,15,8,15],[10,50,12,50],[10,44,12,44],[10,45,12,45],[10,46,12,46],[10,47,12,47],[10,48,12,48],[0,22,0,26],[2,2,2,18],[45,8,45,9],[10,19,12,19],[10,3,11,3],[8,17,8,18],[10,20,12,20],[5,5,5,8],[6,26,7,26],[8,2,8,3],[8,4,8,8],[11,6,11,7],[45,22,45,24],[5,10,5,13],[7,10,8,10],[7,13,8,13],[5,27,6,27],[8,26,9,26],[10,22,10,26],[11,23,11,24],[11,25,11,26],[5,22,5,24],[11,22,12,22],[48,22,48,24],[46,22,46,24],[45,19,45,21],[46,19,46,21],[47,19,47,21],[48,19,48,21],[47,22,47,24],[5,16,6,16],[48,2,48,3],[48,4,48,9],[5,17,7,18],[10,12,12,12],[10,13,12,13],[10,15,12,15],[10,16,12,16],[48,17,48,18],[7,4,7,8],[5,2,5,4],[7,2,7,3],[11,17,11,18],[10,8,11,9],[10,4,10,7],[7,11,8,11],[2,74,11,74],[2,69,11,69],[2,70,11,70],[2,71,11,71],[2,72,11,72],[2,73,11,73]]}
[]
[]
[null,null,null,null,null,null,null,null,null,null,null,null,null,null,null,null,null,null,null,null,null,null,null,null,null,null,null,null,null,null,null,null,null,null,null,null,null,null,null,null,null,null,null,null,null,null,null,null,null,null,null,null,null,null,null,null,null,null,null,null,null,null,null,null,null,null,null,null,null,{"$f":"IF(AND(Parameter!B69<>\"\"),Parameter!B69&\" \"&Parameter!E69&\"%\",\"\")","v":"Zuschlag vor DP-Beginn 25%"},{"$f":"IF(AND(Parameter!E70<>\"\",Parameter!F70<>\"\"),Parameter!B70&\" \"&TEXT(Parameter!F70,\"hh:mm\")&\" \"&Parameter!E70&\"%\",\"\")","v":"Zuschlag innerhalb DP \nnach 1.Uhrzeit 19:30 50%"},{"$f":"Parameter!B71&\" \"&TEXT(Parameter!F71,\"hh:mm\")&\" \"&Parameter!E71&\"%\"","v":"Zuschlag innerhalb DP \nnach 2.Uhrzeit 21:00 75%"},{"$f":"Parameter!B72&\" \"&TEXT(Parameter!F72,\"hh:mm\")&\" \"&Parameter!E72&\"%\"","v":"Zuschlag außerhalb DP \nnach 1.Uhrzeit 19:30 100%"},{"$f":"Parameter!B73&\" \"&TEXT(Parameter!F73,\"hh:mm\")&\" \"&Parameter!E73&\"%\"","v":"Zuschlag außerhalb DP \nnach 2.Uhrzeit 21:00 125%"},{"$f":"IF(AND(Parameter!B74<>\"\"),Parameter!B74&\" \"&Parameter!E74&\"%\",\"\")","v":"Zuschlag nach DP-Ende 150%"}]
[]
[]
[null,null,"Monat",null,null,{"$f":"MonatsErster+274","v":"2020-10-01"},null,null,null,null,"täglich",null,null,null,"So/Feier","Woche",{"$f":"IF(LEFT(Parameter!J62,1)=\"1\",\"Manuell\",\"Morgen Zeit\")","v":"Manuell"},"Vortrag\nVormonat"]
[]
[null,null,"MitarbeitNr.",null,{"$f":"IF('1 JAN'!E8<>\"\",'1 JAN'!E8,\"\")","v":""},null,null,null,null,null,{"$f":"Parameter!Q50","v":">21:00   100% Üh   "},{"$f":"Parameter!Q52","v":">19:30   50% Üh   "},{"$f":"Parameter!Q54","v":">9h                 50% Üh   "},{"$f":"Parameter!Q56","v":"> Soll-h bis 9 Std.                    50% Üh   "},{"$f":"Parameter!Q58","v":"So/Feiert 100% Üh   "},{"$f":"Parameter!Q60","v":">39h      100% Üh   "},{"$f":"Parameter!Q62","v":"manuell    50% Mh   "}]
[null,null,"Name:",null,{"$f":"IF('1 JAN'!E9<>\"\",'1 JAN'!E9,\"\")","v":""},null,null,null,null,null,null,null,null,null,null,null,null,{"$f":"IF(Parameter!F34=TRUE,'9 SEP'!R49:S49,0)","v":0}]
[null,null,null,{"$f":"IF(D16=\"Fr\",\"JA\",\"\")","v":""}]
[null,null,"Datum","Tag","tatsächliche Arbeitszeit",null,null,null," Gesamt\nStunden",null,{"$f":"MID(Parameter!F50,3,99)","v":"Grund-Stunde ZA - Zuschlag auszahlen"},{"$f":"MID(Parameter!F52,3,99)","v":"Grund-Stunde ZA - Zuschlag auszahlen"},{"$f":"MID(Parameter!F54,3,99)","v":"Grund-Stunde ZA - Zuschlag auszahlen"},{"$f":"MID(Parameter!F56,3,99)","v":"Grund-Stunde ZA - Zuschlag auszahlen"},{"$f":"MID(Parameter!F58,3,99)","v":"Grund-Stunde ZA - Zuschlag auszahlen"},{"$f":"MID(Parameter!F60,3,99)","v":"Grund-Stunde ZA - Zuschlag auszahlen"},{"$f":"MID(Parameter!F62,3,99)","v":"Grund-Stunde ZA - Zuschlag auszahlen"},"Gut-","Minus-"," Urlaub\nKrank\n\nU oder K \nmachen","Feiertag\n\nF-ix\nB-ewegl.",null,{"$f":"IF(AND(UPPER(Parameter!G68=\"AKTIV\"),UPPER(Parameter!R69=\"AKTIV\")),\"Dienstplan-Vorschlag übernehmen\",IF(UPPER(Parameter!G68=\"AKTIV\"),\"Dienstplan\",\"Manuelle Zeiterfassung\"))","v":"Manuelle Zeiterfassung"},null,null,null,null,null,null,null,null,null,null,null,null,null,null,null,null,null,null,null,"Aktueller\nTages\nSaldo","Summe Grundstunden\nim Zeitsaldo","Summe \nZuschlag \nZeitsaldo \nerhöhend","Summe Grundstunden\nzur Auszahlung","Summe \nZuschlag\nzur Auszahlung","Korrigierter Tagessaldo","Korrigierte \nTages IST-Std","Differenz SOLL-Std zu IST-Std inkl. Zeitsaldo Korrekturen","Tagesstunden + sonntags Summe Wochen-\nStunden","Wochen\nsumme \n(korrigiert)"]
[null,null,null,null,"Vormittag",null,"Nachmittag",null,null,null,null,null,null,null,null,null,null,"Stunden",null,null,null,null,{"$f":"IF(UPPER(Parameter!G68)=\"AKTIV\",\"Manuelle Zeiten in Spalte W sind monatlich manuell in die Spalten E-H zu übernehmen\",\"Begründung manuelle Zeiterfassung\")","v":"Begründung manuelle Zeiterfassung"},"Vormittag",null,"Nachmittag"]
[null,"OK",null,null,"von","bis","von","bis","Ist","Soll",null,null,null,null,null,null,null,"+","-",null,null,null,null,"von","bis","von","bis",null,null,null,"Anmerkung","Internet AN Vorm.","Differenz","Anzahl Internetzeiten","Internet AB Vorm","Differenz","Internet AN Nachm.","Differenz","Internet AB Nachm.","Differenz",null,null,null,null,null,null,null,null,null,null,null,null,null,null,null,null,null,null,null,null,null,null,null,null,null,null,null,null,null,{"$f":"SUM(BR14:BR44)","v":0},0,0,0,0,0]
[null,null,{"$f":"DATE('1 JAN'!G2,10,1)","v":"2020-10-01"},{"$f":"C14","v":"2020-10-01"},null,null,null,null,{"$f":"IF(LEN(F14)+LEN(H14)>0,IF(LEN(H14)>0,(HOUR(F14-E14)+MINUTE(F14-E14)/60)+(HOUR(H14-G14)+MINUTE(H14-G14)/60),(HOUR(F14-E14)+MINUTE(F14-E14)/60)),IF(Parameter!$F$29=1,J14,IF(T14=\"\",0,J14)))","v":0},null,null,null,null,null,null,null,null,{"$f":"IF(I14>J14,I14-J14,0)","v":0},{"$f":"IF(C14<=TODAY(),IF(I14<J14,J14-I14,0),0)","v":0},null,null,null,null,null,null,null,null,null,null,null,null,null,{"$f":"IF(AF14<>\"\",IF(E14<>\"\",ABS(24*60*(E14-AF14)),ABS(24*60*(G14-AF14))),0)","v":0},{"$f":"COUNTA(AF14,AI14,AK14,AM14)","v":0},null,{"$f":"IF(AI14<>\"\",IF(H14<>\"\",ABS(24*60*(H14-AI14)),ABS(24*60*(F14-AI14))),0)","v":0},null,{"$f":"IF(AK14<>\"\",IF(E14<>\"\",ABS(24*60*(E14-AK14)),ABS(24*60*(G14-AK14))),0)","v":0},null,{"$f":"IF(AM14<>\"\",IF(H14<>\"\",ABS(24*60*(H14-AM14)),ABS(24*60*(F14-AM14))),0)","v":0},null,null,{"$f":"R9+R14-S14","v":0}]
[null,null,{"$f":"IF(MONTH(C14+1)>MONTH(C14),\"\",C14+1)","v":"2020-10-02"},"2020-10-02",null,null,null,null,{"$f":"IF(LEN(F15)+LEN(H15)>0,IF(LEN(H15)>0,(HOUR(F15-E15)+MINUTE(F15-E15)/60)+(HOUR(H15-G15)+MINUTE(H15-G15)/60),(HOUR(F15-E15)+MINUTE(F15-E15)/60)),IF(Parameter!$F$29=1,J15,IF(T15=\"\",0,J15)))","v":0},null,null,null,null,null,null,null,null,{"$f":"IF(I15>J15,I15-J15,0)","v":0},{"$f":"IF(C15<=TODAY(),IF(I15<J15,J15-I15,0),0)","v":0},null,null,null,null,null,null,null,null,null,null,null,null,null,{"$f":"IF(AF15<>\"\",IF(E15<>\"\",ABS(24*60*(E15-AF15)),ABS(24*60*(G15-AF15))),0)","v":0},{"$f":"COUNTA(AF15,AI15,AK15,AM15)","v":0},null,{"$f":"IF(AI15<>\"\",IF(H15<>\"\",ABS(24*60*(H15-AI15)),ABS(24*60*(F15-AI15))),0)","v":0},null,{"$f":"IF(AK15<>\"\",IF(E15<>\"\",ABS(24*60*(E15-AK15)),ABS(24*60*(G15-AK15))),0)","v":0},null,{"$f":"IF(AM15<>\"\",IF(H15<>\"\",ABS(24*60*(H15-AM15)),ABS(24*60*(F15-AM15))),0)","v":0},null,null,{"$f":"AQ14+R15-S15","v":0}]
[null,null,"2020-10-03","2020-10-03",null,null,null,null,{"$f":"IF(LEN(F16)+LEN(H16)>0,IF(LEN(H16)>0,(HOUR(F16-E16)+MINUTE(F16-E16)/60)+(HOUR(H16-G16)+MINUTE(H16-G16)/60),(HOUR(F16-E16)+MINUTE(F16-E16)/60)),IF(Parameter!$F$29=1,J16,IF(T16=\"\",0,J16)))","v":0},null,null,null,null,null,null,null,null,{"$f":"IF(I16>J16,I16-J16,0)","v":0},{"$f":"IF(C16<=TODAY(),IF(I16<J16,J16-I16,0),0)","v":0},null,null,null,null,null,null,null,null,null,null,null,null,null,{"$f":"IF(AF16<>\"\",IF(E16<>\"\",ABS(24*60*(E16-AF16)),ABS(24*60*(G16-AF16))),0)","v":0},{"$f":"COUNTA(AF16,AI16,AK16,AM16)","v":0},null,{"$f":"IF(AI16<>\"\",IF(H16<>\"\",ABS(24*60*(H16-AI16)),ABS(24*60*(F16-AI16))),0)","v":0},null,{"$f":"IF(AK16<>\"\",IF(E16<>\"\",ABS(24*60*(E16-AK16)),ABS(24*60*(G16-AK16))),0)","v":0},null,{"$f":"IF(AM16<>\"\",IF(H16<>\"\",ABS(24*60*(H16-AM16)),ABS(24*60*(F16-AM16))),0)","v":0},null,null,{"$f":"AQ15+R16-S16","v":0}]
[null,null,"2020-10-04","2020-10-04",null,null,null,null,{"$f":"IF(LEN(F17)+LEN(H17)>0,IF(LEN(H17)>0,(HOUR(F17-E17)+MINUTE(F17-E17)/60)+(HOUR(H17-G17)+MINUTE(H17-G17)/60),(HOUR(F17-E17)+MINUTE(F17-E17)/60)),IF(Parameter!$F$29=1,J17,IF(T17=\"\",0,J17)))","v":0},null,null,null,null,null,null,null,null,{"$f":"IF(I17>J17,I17-J17,0)","v":0},{"$f":"IF(C17<=TODAY(),IF(I17<J17,J17-I17,0),0)","v":0},null,null,null,null,null,null,null,null,null,null,null,null,null,{"$f":"IF(AF17<>\"\",IF(E17<>\"\",ABS(24*60*(E17-AF17)),ABS(24*60*(G17-AF17))),0)","v":0},{"$f":"COUNTA(AF17,AI17,AK17,AM17)","v":0},null,{"$f":"IF(AI17<>\"\",IF(H17<>\"\",ABS(24*60*(H17-AI17)),ABS(24*60*(F17-AI17))),0)","v":0},null,{"$f":"IF(AK17<>\"\",IF(E17<>\"\",ABS(24*60*(E17-AK17)),ABS(24*60*(G17-AK17))),0)","v":0},null,{"$f":"IF(AM17<>\"\",IF(H17<>\"\",ABS(24*60*(H17-AM17)),ABS(24*60*(F17-AM17))),0)","v":0},null,null,{"$f":"AQ16+R17-S17","v":0}]
[null,null,"2020-10-05","2020-10-05",null,null,null,null,{"$f":"IF(LEN(F18)+LEN(H18)>0,IF(LEN(H18)>0,(HOUR(F18-E18)+MINUTE(F18-E18)/60)+(HOUR(H18-G18)+MINUTE(H18-G18)/60),(HOUR(F18-E18)+MINUTE(F18-E18)/60)),IF(Parameter!$F$29=1,J18,IF(T18=\"\",0,J18)))","v":0},null,null,null,null,null,null,null,null,{"$f":"IF(I18>J18,I18-J18,0)","v":0},{"$f":"IF(C18<=TODAY(),IF(I18<J18,J18-I18,0),0)","v":0},null,null,null,null,null,null,null,null,null,null,null,null,null,{"$f":"IF(AF18<>\"\",IF(E18<>\"\",ABS(24*60*(E18-AF18)),ABS(24*60*(G18-AF18))),0)","v":0},{"$f":"COUNTA(AF18,AI18,AK18,AM18)","v":0},null,{"$f":"IF(AI18<>\"\",IF(H18<>\"\",ABS(24*60*(H18-AI18)),ABS(24*60*(F18-AI18))),0)","v":0},null,{"$f":"IF(AK18<>\"\",IF(E18<>\"\",ABS(24*60*(E18-AK18)),ABS(24*60*(G18-AK18))),0)","v":0},null,{"$f":"IF(AM18<>\"\",IF(H18<>\"\",ABS(24*60*(H18-AM18)),ABS(24*60*(F18-AM18))),0)","v":0},null,null,{"$f":"AQ17+R18-S18","v":0}]
[null,null,"2020-10-06","2020-10-06",null,null,null,null,{"$f":"IF(LEN(F19)+LEN(H19)>0,IF(LEN(H19)>0,(HOUR(F19-E19)+MINUTE(F19-E19)/60)+(HOUR(H19-G19)+MINUTE(H19-G19)/60),(HOUR(F19-E19)+MINUTE(F19-E19)/60)),IF(Parameter!$F$29=1,J19,IF(T19=\"\",0,J19)))","v":0},null,null,null,null,null,null,null,null,{"$f":"IF(I19>J19,I19-J19,0)","v":0},{"$f":"IF(C19<=TODAY(),IF(I19<J19,J19-I19,0),0)","v":0},null,null,null,null,null,null,null,null,null,null,null,null,null,{"$f":"IF(AF19<>\"\",IF(E19<>\"\",ABS(24*60*(E19-AF19)),ABS(24*60*(G19-AF19))),0)","v":0},{"$f":"COUNTA(AF19,AI19,AK19,AM19)","v":0},null,{"$f":"IF(AI19<>\"\",IF(H19<>\"\",ABS(24*60*(H19-AI19)),ABS(24*60*(F19-AI19))),0)","v":0},null,{"$f":"IF(AK19<>\"\",IF(E19<>\"\",ABS(24*60*(E19-AK19)),ABS(24*60*(G19-AK19))),0)","v":0},null,{"$f":"IF(AM19<>\"\",IF(H19<>\"\",ABS(24*60*(H19-AM19)),ABS(24*60*(F19-AM19))),0)","v":0},null,null,{"$f":"AQ18+R19-S19","v":0}]
[null,null,"2020-10-07","2020-10-07",null,null,null,null,{"$f":"IF(LEN(F20)+LEN(H20)>0,IF(LEN(H20)>0,(HOUR(F20-E20)+MINUTE(F20-E20)/60)+(HOUR(H20-G20)+MINUTE(H20-G20)/60),(HOUR(F20-E20)+MINUTE(F20-E20)/60)),IF(Parameter!$F$29=1,J20,IF(T20=\"\",0,J20)))","v":0},null,null,null,null,null,null,null,null,{"$f":"IF(I20>J20,I20-J20,0)","v":0},{"$f":"IF(C20<=TODAY(),IF(I20<J20,J20-I20,0),0)","v":0},null,null,null,null,null,null,null,null,null,null,null,null,null,{"$f":"IF(AF20<>\"\",IF(E20<>\"\",ABS(24*60*(E20-AF20)),ABS(24*60*(G20-AF20))),0)","v":0},{"$f":"COUNTA(AF20,AI20,AK20,AM20)","v":0},null,{"$f":"IF(AI20<>\"\",IF(H20<>\"\",ABS(24*60*(H20-AI20)),ABS(24*60*(F20-AI20))),0)","v":0},null,{"$f":"IF(AK20<>\"\",IF(E20<>\"\",ABS(24*60*(E20-AK20)),ABS(24*60*(G20-AK20))),0)","v":0},null,{"$f":"IF(AM20<>\"\",IF(H20<>\"\",ABS(24*60*(H20-AM20)),ABS(24*60*(F20-AM20))),0)","v":0},null,null,{"$f":"AQ19+R20-S20","v":0}]
[null,null,"2020-10-08","2020-10-08",null,null,null,null,{"$f":"IF(LEN(F21)+LEN(H21)>0,IF(LEN(H21)>0,(HOUR(F21-E21)+MINUTE(F21-E21)/60)+(HOUR(H21-G21)+MINUTE(H21-G21)/60),(HOUR(F21-E21)+MINUTE(F21-E21)/60)),IF(Parameter!$F$29=1,J21,IF(T21=\"\",0,J21)))","v":0},null,null,null,null,null,null,null,null,{"$f":"IF(I21>J21,I21-J21,0)","v":0},{"$f":"IF(C21<=TODAY(),IF(I21<J21,J21-I21,0),0)","v":0},null,null,null,null,null,null,null,null,null,null,null,null,null,{"$f":"IF(AF21<>\"\",IF(E21<>\"\",ABS(24*60*(E21-AF21)),ABS(24*60*(G21-AF21))),0)","v":0},{"$f":"COUNTA(AF21,AI21,AK21,AM21)","v":0},null,{"$f":"IF(AI21<>\"\",IF(H21<>\"\",ABS(24*60*(H21-AI21)),ABS(24*60*(F21-AI21))),0)","v":0},null,{"$f":"IF(AK21<>\"\",IF(E21<>\"\",ABS(24*60*(E21-AK21)),ABS(24*60*(G21-AK21))),0)","v":0},null,{"$f":"IF(AM21<>\"\",IF(H21<>\"\",ABS(24*60*(H21-AM21)),ABS(24*60*(F21-AM21))),0)","v":0},null,null,{"$f":"AQ20+R21-S21","v":0}]
[null,null,"2020-10-09","2020-10-09",null,null,null,null,{"$f":"IF(LEN(F22)+LEN(H22)>0,IF(LEN(H22)>0,(HOUR(F22-E22)+MINUTE(F22-E22)/60)+(HOUR(H22-G22)+MINUTE(H22-G22)/60),(HOUR(F22-E22)+MINUTE(F22-E22)/60)),IF(Parameter!$F$29=1,J22,IF(T22=\"\",0,J22)))","v":0},null,null,null,null,null,null,null,null,{"$f":"IF(I22>J22,I22-J22,0)","v":0},{"$f":"IF(C22<=TODAY(),IF(I22<J22,J22-I22,0),0)","v":0},null,null,null,null,null,null,null,null,null,null,null,null,null,{"$f":"IF(AF22<>\"\",IF(E22<>\"\",ABS(24*60*(E22-AF22)),ABS(24*60*(G22-AF22))),0)","v":0},{"$f":"COUNTA(AF22,AI22,AK22,AM22)","v":0},null,{"$f":"IF(AI22<>\"\",IF(H22<>\"\",ABS(24*60*(H22-AI22)),ABS(24*60*(F22-AI22))),0)","v":0},null,{"$f":"IF(AK22<>\"\",IF(E22<>\"\",ABS(24*60*(E22-AK22)),ABS(24*60*(G22-AK22))),0)","v":0},null,{"$f":"IF(AM22<>\"\",IF(H22<>\"\",ABS(24*60*(H22-AM22)),ABS(24*60*(F22-AM22))),0)","v":0},null,null,{"$f":"AQ21+R22-S22","v":0}]
[null,null,"2020-10-10","2020-10-10",null,null,null,null,{"$f":"IF(LEN(F23)+LEN(H23)>0,IF(LEN(H23)>0,(HOUR(F23-E23)+MINUTE(F23-E23)/60)+(HOUR(H23-G23)+MINUTE(H23-G23)/60),(HOUR(F23-E23)+MINUTE(F23-E23)/60)),IF(Parameter!$F$29=1,J23,IF(T23=\"\",0,J23)))","v":0},null,null,null,null,null,null,null,null,{"$f":"IF(I23>J23,I23-J23,0)","v":0},{"$f":"IF(C23<=TODAY(),IF(I23<J23,J23-I23,0),0)","v":0},null,null,null,null,null,null,null,null,null,null,null,null,null,{"$f":"IF(AF23<>\"\",IF(E23<>\"\",ABS(24*60*(E23-AF23)),ABS(24*60*(G23-AF23))),0)","v":0},{"$f":"COUNTA(AF23,AI23,AK23,AM23)","v":0},null,{"$f":"IF(AI23<>\"\",IF(H23<>\"\",ABS(24*60*(H23-AI23)),ABS(24*60*(F23-AI23))),0)","v":0},null,{"$f":"IF(AK23<>\"\",IF(E23<>\"\",ABS(24*60*(E23-AK23)),ABS(24*60*(G23-AK23))),0)","v":0},null,{"$f":"IF(AM23<>\"\",IF(H23<>\"\",ABS(24*60*(H23-AM23)),ABS(24*60*(F23-AM23))),0)","v":0},null,null,{"$f":"AQ22+R23-S23","v":0}]
[null,null,"2020-10-11","2020-10-11",null,null,null,null,{"$f":"IF(LEN(F24)+LEN(H24)>0,IF(LEN(H24)>0,(HOUR(F24-E24)+MINUTE(F24-E24)/60)+(HOUR(H24-G24)+MINUTE(H24-G24)/60),(HOUR(F24-E24)+MINUTE(F24-E24)/60)),IF(Parameter!$F$29=1,J24,IF(T24=\"\",0,J24)))","v":0},null,null,null,null,null,null,null,null,{"$f":"IF(I24>J24,I24-J24,0)","v":0},{"$f":"IF(C24<=TODAY(),IF(I24<J24,J24-I24,0),0)","v":0},null,null,null,null,null,null,null,null,null,null,null,null,null,{"$f":"IF(AF24<>\"\",IF(E24<>\"\",ABS(24*60*(E24-AF24)),ABS(24*60*(G24-AF24))),0)","v":0},{"$f":"COUNTA(AF24,AI24,AK24,AM24)","v":0},null,{"$f":"IF(AI24<>\"\",IF(H24<>\"\",ABS(24*60*(H24-AI24)),ABS(24*60*(F24-AI24))),0)","v":0},null,{"$f":"IF(AK24<>\"\",IF(E24<>\"\",ABS(24*60*(E24-AK24)),ABS(24*60*(G24-AK24))),0)","v":0},null,{"$f":"IF(AM24<>\"\",IF(H24<>\"\",ABS(24*60*(H24-AM24)),ABS(24*60*(F24-AM24))),0)","v":0},null,null,{"$f":"AQ23+R24-S24","v":0}]
[null,null,"2020-10-12","2020-10-12",null,null,null,null,{"$f":"IF(LEN(F25)+LEN(H25)>0,IF(LEN(H25)>0,(HOUR(F25-E25)+MINUTE(F25-E25)/60)+(HOUR(H25-G25)+MINUTE(H25-G25)/60),(HOUR(F25-E25)+MINUTE(F25-E25)/60)),IF(Parameter!$F$29=1,J25,IF(T25=\"\",0,J25)))","v":0},null,null,null,null,null,null,null,null,{"$f":"IF(I25>J25,I25-J25,0)","v":0},{"$f":"IF(C25<=TODAY(),IF(I25<J25,J25-I25,0),0)","v":0},null,null,null,null,null,null,null,null,null,null,null,null,null,{"$f":"IF(AF25<>\"\",IF(E25<>\"\",ABS(24*60*(E25-AF25)),ABS(24*60*(G25-AF25))),0)","v":0},{"$f":"COUNTA(AF25,AI25,AK25,AM25)","v":0},null,{"$f":"IF(AI25<>\"\",IF(H25<>\"\",ABS(24*60*(H25-AI25)),ABS(24*60*(F25-AI25))),0)","v":0},null,{"$f":"IF(AK25<>\"\",IF(E25<>\"\",ABS(24*60*(E25-AK25)),ABS(24*60*(G25-AK25))),0)","v":0},null,{"$f":"IF(AM25<>\"\",IF(H25<>\"\",ABS(24*60*(H25-AM25)),ABS(24*60*(F25-AM25))),0)","v":0},null,null,{"$f":"AQ24+R25-S25","v":0}]
[null,null,"2020-10-13","2020-10-13",null,null,null,null,{"$f":"IF(LEN(F26)+LEN(H26)>0,IF(LEN(H26)>0,(HOUR(F26-E26)+MINUTE(F26-E26)/60)+(HOUR(H26-G26)+MINUTE(H26-G26)/60),(HOUR(F26-E26)+MINUTE(F26-E26)/60)),IF(Parameter!$F$29=1,J26,IF(T26=\"\",0,J26)))","v":0},null,null,null,null,null,null,null,null,{"$f":"IF(I26>J26,I26-J26,0)","v":0},{"$f":"IF(C26<=TODAY(),IF(I26<J26,J26-I26,0),0)","v":0},null,null,null,null,null,null,null,null,null,null,null,null,null,{"$f":"IF(AF26<>\"\",IF(E26<>\"\",ABS(24*60*(E26-AF26)),ABS(24*60*(G26-AF26))),0)","v":0},{"$f":"COUNTA(AF26,AI26,AK26,AM26)","v":0},null,{"$f":"IF(AI26<>\"\",IF(H26<>\"\",ABS(24*60*(H26-AI26)),ABS(24*60*(F26-AI26))),0)","v":0},null,{"$f":"IF(AK26<>\"\",IF(E26<>\"\",ABS(24*60*(E26-AK26)),ABS(24*60*(G26-AK26))),0)","v":0},null,{"$f":"IF(AM26<>\"\",IF(H26<>\"\",ABS(24*60*(H26-AM26)),ABS(24*60*(F26-AM26))),0)","v":0},null,null,{"$f":"AQ25+R26-S26","v":0}]
[null,null,"2020-10-14","2020-10-14",null,null,null,null,{"$f":"IF(LEN(F27)+LEN(H27)>0,IF(LEN(H27)>0,(HOUR(F27-E27)+MINUTE(F27-E27)/60)+(HOUR(H27-G27)+MINUTE(H27-G27)/60),(HOUR(F27-E27)+MINUTE(F27-E27)/60)),IF(Parameter!$F$29=1,J27,IF(T27=\"\",0,J27)))","v":0},null,null,null,null,null,null,null,null,{"$f":"IF(I27>J27,I27-J27,0)","v":0},{"$f":"IF(C27<=TODAY(),IF(I27<J27,J27-I27,0),0)","v":0},null,null,null,null,null,null,null,null,null,null,null,null,null,{"$f":"IF(AF27<>\"\",IF(E27<>\"\",ABS(24*60*(E27-AF27)),ABS(24*60*(G27-AF27))),0)","v":0},{"$f":"COUNTA(AF27,AI27,AK27,AM27)","v":0},null,{"$f":"IF(AI27<>\"\",IF(H27<>\"\",ABS(24*60*(H27-AI27)),ABS(24*60*(F27-AI27))),0)","v":0},null,{"$f":"IF(AK27<>\"\",IF(E27<>\"\",ABS(24*60*(E27-AK27)),ABS(24*60*(G27-AK27))),0)","v":0},null,{"$f":"IF(AM27<>\"\",IF(H27<>\"\",ABS(24*60*(H27-AM27)),ABS(24*60*(F27-AM27))),0)","v":0},null,null,{"$f":"AQ26+R27-S27","v":0}]
[null,null,"2020-10-15","2020-10-15",null,null,null,null,{"$f":"IF(LEN(F28)+LEN(H28)>0,IF(LEN(H28)>0,(HOUR(F28-E28)+MINUTE(F28-E28)/60)+(HOUR(H28-G28)+MINUTE(H28-G28)/60),(HOUR(F28-E28)+MINUTE(F28-E28)/60)),IF(Parameter!$F$29=1,J28,IF(T28=\"\",0,J28)))","v":0},null,null,null,null,null,null,null,null,{"$f":"IF(I28>J28,I28-J28,0)","v":0},{"$f":"IF(C28<=TODAY(),IF(I28<J28,J28-I28,0),0)","v":0},null,null,null,null,null,null,null,null,null,null,null,null,null,{"$f":"IF(AF28<>\"\",IF(E28<>\"\",ABS(24*60*(E28-AF28)),ABS(24*60*(G28-AF28))),0)","v":0},{"$f":"COUNTA(AF28,AI28,AK28,AM28)","v":0},null,{"$f":"IF(AI28<>\"\",IF(H28<>\"\",ABS(24*60*(H28-AI28)),ABS(24*60*(F28-AI28))),0)","v":0},null,{"$f":"IF(AK28<>\"\",IF(E28<>\"\",ABS(24*60*(E28-AK28)),ABS(24*60*(G28-AK28))),0)","v":0},null,{"$f":"IF(AM28<>\"\",IF(H28<>\"\",ABS(24*60*(H28-AM28)),ABS(24*60*(F28-AM28))),0)","v":0},null,null,{"$f":"AQ27+R28-S28","v":0}]
[null,null,"2020-10-16","2020-10-16",null,null,null,null,{"$f":"IF(LEN(F29)+LEN(H29)>0,IF(LEN(H29)>0,(HOUR(F29-E29)+MINUTE(F29-E29)/60)+(HOUR(H29-G29)+MINUTE(H29-G29)/60),(HOUR(F29-E29)+MINUTE(F29-E29)/60)),IF(Parameter!$F$29=1,J29,IF(T29=\"\",0,J29)))","v":0},null,null,null,null,null,null,null,null,{"$f":"IF(I29>J29,I29-J29,0)","v":0},{"$f":"IF(C29<=TODAY(),IF(I29<J29,J29-I29,0),0)","v":0},null,null,null,null,null,null,null,null,null,null,null,null,null,{"$f":"IF(AF29<>\"\",IF(E29<>\"\",ABS(24*60*(E29-AF29)),ABS(24*60*(G29-AF29))),0)","v":0},{"$f":"COUNTA(AF29,AI29,AK29,AM29)","v":0},null,{"$f":"IF(AI29<>\"\",IF(H29<>\"\",ABS(24*60*(H29-AI29)),ABS(24*60*(F29-AI29))),0)","v":0},null,{"$f":"IF(AK29<>\"\",IF(E29<>\"\",ABS(24*60*(E29-AK29)),ABS(24*60*(G29-AK29))),0)","v":0},null,{"$f":"IF(AM29<>\"\",IF(H29<>\"\",ABS(24*60*(H29-AM29)),ABS(24*60*(F29-AM29))),0)","v":0},null,null,{"$f":"AQ28+R29-S29","v":0}]
[null,null,"2020-10-17","2020-10-17",null,null,null,null,{"$f":"IF(LEN(F30)+LEN(H30)>0,IF(LEN(H30)>0,(HOUR(F30-E30)+MINUTE(F30-E30)/60)+(HOUR(H30-G30)+MINUTE(H30-G30)/60),(HOUR(F30-E30)+MINUTE(F30-E30)/60)),IF(Parameter!$F$29=1,J30,IF(T30=\"\",0,J30)))","v":0},null,null,null,null,null,null,null,null,{"$f":"IF(I30>J30,I30-J30,0)","v":0},{"$f":"IF(C30<=TODAY(),IF(I30<J30,J30-I30,0),0)","v":0},null,null,null,null,null,null,null,null,null,null,null,null,null,{"$f":"IF(AF30<>\"\",IF(E30<>\"\",ABS(24*60*(E30-AF30)),ABS(24*60*(G30-AF30))),0)","v":0},{"$f":"COUNTA(AF30,AI30,AK30,AM30)","v":0},null,{"$f":"IF(AI30<>\"\",IF(H30<>\"\",ABS(24*60*(H30-AI30)),ABS(24*60*(F30-AI30))),0)","v":0},null,{"$f":"IF(AK30<>\"\",IF(E30<>\"\",ABS(24*60*(E30-AK30)),ABS(24*60*(G30-AK30))),0)","v":0},null,{"$f":"IF(AM30<>\"\",IF(H30<>\"\",ABS(24*60*(H30-AM30)),ABS(24*60*(F30-AM30))),0)","v":0},null,null,{"$f":"AQ29+R30-S30","v":0}]
[null,null,"2020-10-18","2020-10-18",null,null,null,null,{"$f":"IF(LEN(F31)+LEN(H31)>0,IF(LEN(H31)>0,(HOUR(F31-E31)+MINUTE(F31-E31)/60)+(HOUR(H31-G31)+MINUTE(H31-G31)/60),(HOUR(F31-E31)+MINUTE(F31-E31)/60)),IF(Parameter!$F$29=1,J31,IF(T31=\"\",0,J31)))","v":0},null,null,null,null,null,null,null,null,{"$f":"IF(I31>J31,I31-J31,0)","v":0},{"$f":"IF(C31<=TODAY(),IF(I31<J31,J31-I31,0),0)","v":0},null,null,null,null,null,null,null,null,null,null,null,null,null,{"$f":"IF(AF31<>\"\",IF(E31<>\"\",ABS(24*60*(E31-AF31)),ABS(24*60*(G31-AF31))),0)","v":0},{"$f":"COUNTA(AF31,AI31,AK31,AM31)","v":0},null,{"$f":"IF(AI31<>\"\",IF(H31<>\"\",ABS(24*60*(H31-AI31)),ABS(24*60*(F31-AI31))),0)","v":0},null,{"$f":"IF(AK31<>\"\",IF(E31<>\"\",ABS(24*60*(E31-AK31)),ABS(24*60*(G31-AK31))),0)","v":0},null,{"$f":"IF(AM31<>\"\",IF(H31<>\"\",ABS(24*60*(H31-AM31)),ABS(24*60*(F31-AM31))),0)","v":0},null,null,{"$f":"AQ30+R31-S31","v":0}]
[null,null,"2020-10-19","2020-10-19",null,null,null,null,{"$f":"IF(LEN(F32)+LEN(H32)>0,IF(LEN(H32)>0,(HOUR(F32-E32)+MINUTE(F32-E32)/60)+(HOUR(H32-G32)+MINUTE(H32-G32)/60),(HOUR(F32-E32)+MINUTE(F32-E32)/60)),IF(Parameter!$F$29=1,J32,IF(T32=\"\",0,J32)))","v":0},null,null,null,null,null,null,null,null,{"$f":"IF(I32>J32,I32-J32,0)","v":0},{"$f":"IF(C32<=TODAY(),IF(I32<J32,J32-I32,0),0)","v":0},null,null,null,null,null,null,null,null,null,null,null,null,null,{"$f":"IF(AF32<>\"\",IF(E32<>\"\",ABS(24*60*(E32-AF32)),ABS(24*60*(G32-AF32))),0)","v":0},{"$f":"COUNTA(AF32,AI32,AK32,AM32)","v":0},null,{"$f":"IF(AI32<>\"\",IF(H32<>\"\",ABS(24*60*(H32-AI32)),ABS(24*60*(F32-AI32))),0)","v":0},null,{"$f":"IF(AK32<>\"\",IF(E32<>\"\",ABS(24*60*(E32-AK32)),ABS(24*60*(G32-AK32))),0)","v":0},null,{"$f":"IF(AM32<>\"\",IF(H32<>\"\",ABS(24*60*(H32-AM32)),ABS(24*60*(F32-AM32))),0)","v":0},null,null,{"$f":"AQ31+R32-S32","v":0}]
[null,null,"2020-10-20","2020-10-20",null,null,null,null,{"$f":"IF(LEN(F33)+LEN(H33)>0,IF(LEN(H33)>0,(HOUR(F33-E33)+MINUTE(F33-E33)/60)+(HOUR(H33-G33)+MINUTE(H33-G33)/60),(HOUR(F33-E33)+MINUTE(F33-E33)/60)),IF(Parameter!$F$29=1,J33,IF(T33=\"\",0,J33)))","v":0},null,null,null,null,null,null,null,null,{"$f":"IF(I33>J33,I33-J33,0)","v":0},{"$f":"IF(C33<=TODAY(),IF(I33<J33,J33-I33,0),0)","v":0},null,null,null,null,null,null,null,null,null,null,null,null,null,{"$f":"IF(AF33<>\"\",IF(E33<>\"\",ABS(24*60*(E33-AF33)),ABS(24*60*(G33-AF33))),0)","v":0},{"$f":"COUNTA(AF33,AI33,AK33,AM33)","v":0},null,{"$f":"IF(AI33<>\"\",IF(H33<>\"\",ABS(24*60*(H33-AI33)),ABS(24*60*(F33-AI33))),0)","v":0},null,{"$f":"IF(AK33<>\"\",IF(E33<>\"\",ABS(24*60*(E33-AK33)),ABS(24*60*(G33-AK33))),0)","v":0},null,{"$f":"IF(AM33<>\"\",IF(H33<>\"\",ABS(24*60*(H33-AM33)),ABS(24*60*(F33-AM33))),0)","v":0},null,null,{"$f":"AQ32+R33-S33","v":0}]
[null,null,"2020-10-21","2020-10-21",null,null,null,null,{"$f":"IF(LEN(F34)+LEN(H34)>0,IF(LEN(H34)>0,(HOUR(F34-E34)+MINUTE(F34-E34)/60)+(HOUR(H34-G34)+MINUTE(H34-G34)/60),(HOUR(F34-E34)+MINUTE(F34-E34)/60)),IF(Parameter!$F$29=1,J34,IF(T34=\"\",0,J34)))","v":0},null,null,null,null,null,null,null,null,{"$f":"IF(I34>J34,I34-J34,0)","v":0},{"$f":"IF(C34<=TODAY(),IF(I34<J34,J34-I34,0),0)","v":0},null,null,null,null,null,null,null,null,null,null,null,null,null,{"$f":"IF(AF34<>\"\",IF(E34<>\"\",ABS(24*60*(E34-AF34)),ABS(24*60*(G34-AF34))),0)","v":0},{"$f":"COUNTA(AF34,AI34,AK34,AM34)","v":0},null,{"$f":"IF(AI34<>\"\",IF(H34<>\"\",ABS(24*60*(H34-AI34)),ABS(24*60*(F34-AI34))),0)","v":0},null,{"$f":"IF(AK34<>\"\",IF(E34<>\"\",ABS(24*60*(E34-AK34)),ABS(24*60*(G34-AK34))),0)","v":0},null,{"$f":"IF(AM34<>\"\",IF(H34<>\"\",ABS(24*60*(H34-AM34)),ABS(24*60*(F34-AM34))),0)","v":0},null,null,{"$f":"AQ33+R34-S34","v":0}]
[null,null,"2020-10-22","2020-10-22",null,null,null,null,{"$f":"IF(LEN(F35)+LEN(H35)>0,IF(LEN(H35)>0,(HOUR(F35-E35)+MINUTE(F35-E35)/60)+(HOUR(H35-G35)+MINUTE(H35-G35)/60),(HOUR(F35-E35)+MINUTE(F35-E35)/60)),IF(Parameter!$F$29=1,J35,IF(T35=\"\",0,J35)))","v":0},null,null,null,null,null,null,null,null,{"$f":"IF(I35>J35,I35-J35,0)","v":0},{"$f":"IF(C35<=TODAY(),IF(I35<J35,J35-I35,0),0)","v":0},null,null,null,null,null,null,null,null,null,null,null,null,null,{"$f":"IF(AF35<>\"\",IF(E35<>\"\",ABS(24*60*(E35-AF35)),ABS(24*60*(G35-AF35))),0)","v":0},{"$f":"COUNTA(AF35,AI35,AK35,AM35)","v":0},null,{"$f":"IF(AI35<>\"\",IF(H35<>\"\",ABS(24*60*(H35-AI35)),ABS(24*60*(F35-AI35))),0)","v":0},null,{"$f":"IF(AK35<>\"\",IF(E35<>\"\",ABS(24*60*(E35-AK35)),ABS(24*60*(G35-AK35))),0)","v":0},null,{"$f":"IF(AM35<>\"\",IF(H35<>\"\",ABS(24*60*(H35-AM35)),ABS(24*60*(F35-AM35))),0)","v":0},null,null,{"$f":"AQ34+R35-S35","v":0}]
[null,null,"2020-10-23","2020-10-23",null,null,null,null,{"$f":"IF(LEN(F36)+LEN(H36)>0,IF(LEN(H36)>0,(HOUR(F36-E36)+MINUTE(F36-E36)/60)+(HOUR(H36-G36)+MINUTE(H36-G36)/60),(HOUR(F36-E36)+MINUTE(F36-E36)/60)),IF(Parameter!$F$29=1,J36,IF(T36=\"\",0,J36)))","v":0},null,null,null,null,null,null,null,null,{"$f":"IF(I36>J36,I36-J36,0)","v":0},{"$f":"IF(C36<=TODAY(),IF(I36<J36,J36-I36,0),0)","v":0},null,null,null,null,null,null,null,null,null,null,null,null,null,{"$f":"IF(AF36<>\"\",IF(E36<>\"\",ABS(24*60*(E36-AF36)),ABS(24*60*(G36-AF36))),0)","v":0},{"$f":"COUNTA(AF36,AI36,AK36,AM36)","v":0},null,{"$f":"IF(AI36<>\"\",IF(H36<>\"\",ABS(24*60*(H36-AI36)),ABS(24*60*(F36-AI36))),0)","v":0},null,{"$f":"IF(AK36<>\"\",IF(E36<>\"\",ABS(24*60*(E36-AK36)),ABS(24*60*(G36-AK36))),0)","v":0},null,{"$f":"IF(AM36<>\"\",IF(H36<>\"\",ABS(24*60*(H36-AM36)),ABS(24*60*(F36-AM36))),0)","v":0},null,null,{"$f":"AQ35+R36-S36","v":0}]
[null,null,"2020-10-24","2020-10-24",null,null,null,null,{"$f":"IF(LEN(F37)+LEN(H37)>0,IF(LEN(H37)>0,(HOUR(F37-E37)+MINUTE(F37-E37)/60)+(HOUR(H37-G37)+MINUTE(H37-G37)/60),(HOUR(F37-E37)+MINUTE(F37-E37)/60)),IF(Parameter!$F$29=1,J37,IF(T37=\"\",0,J37)))","v":0},null,null,null,null,null,null,null,null,{"$f":"IF(I37>J37,I37-J37,0)","v":0},{"$f":"IF(C37<=TODAY(),IF(I37<J37,J37-I37,0),0)","v":0},null,null,null,null,null,null,null,null,null,null,null,null,null,{"$f":"IF(AF37<>\"\",IF(E37<>\"\",ABS(24*60*(E37-AF37)),ABS(24*60*(G37-AF37))),0)","v":0},{"$f":"COUNTA(AF37,AI37,AK37,AM37)","v":0},null,{"$f":"IF(AI37<>\"\",IF(H37<>\"\",ABS(24*60*(H37-AI37)),ABS(24*60*(F37-AI37))),0)","v":0},null,{"$f":"IF(AK37<>\"\",IF(E37<>\"\",ABS(24*60*(E37-AK37)),ABS(24*60*(G37-AK37))),0)","v":0},null,{"$f":"IF(AM37<>\"\",IF(H37<>\"\",ABS(24*60*(H37-AM37)),ABS(24*60*(F37-AM37))),0)","v":0},null,null,{"$f":"AQ36+R37-S37","v":0}]
[null,null,"2020-10-25","2020-10-25",null,null,null,null,{"$f":"IF(LEN(F38)+LEN(H38)>0,IF(LEN(H38)>0,(HOUR(F38-E38)+MINUTE(F38-E38)/60)+(HOUR(H38-G38)+MINUTE(H38-G38)/60),(HOUR(F38-E38)+MINUTE(F38-E38)/60)),IF(Parameter!$F$29=1,J38,IF(T38=\"\",0,J38)))","v":0},null,null,null,null,null,null,null,null,{"$f":"IF(I38>J38,I38-J38,0)","v":0},{"$f":"IF(C38<=TODAY(),IF(I38<J38,J38-I38,0),0)","v":0},null,null,null,null,null,null,null,null,null,null,null,null,null,{"$f":"IF(AF38<>\"\",IF(E38<>\"\",ABS(24*60*(E38-AF38)),ABS(24*60*(G38-AF38))),0)","v":0},{"$f":"COUNTA(AF38,AI38,AK38,AM38)","v":0},null,{"$f":"IF(AI38<>\"\",IF(H38<>\"\",ABS(24*60*(H38-AI38)),ABS(24*60*(F38-AI38))),0)","v":0},null,{"$f":"IF(AK38<>\"\",IF(E38<>\"\",ABS(24*60*(E38-AK38)),ABS(24*60*(G38-AK38))),0)","v":0},null,{"$f":"IF(AM38<>\"\",IF(H38<>\"\",ABS(24*60*(H38-AM38)),ABS(24*60*(F38-AM38))),0)","v":0},null,null,{"$f":"AQ37+R38-S38","v":0}]
[null,null,"2020-10-26","2020-10-26",null,null,null,null,{"$f":"IF(LEN(F39)+LEN(H39)>0,IF(LEN(H39)>0,(HOUR(F39-E39)+MINUTE(F39-E39)/60)+(HOUR(H39-G39)+MINUTE(H39-G39)/60),(HOUR(F39-E39)+MINUTE(F39-E39)/60)),IF(Parameter!$F$29=1,J39,IF(T39=\"\",0,J39)))","v":0},null,null,null,null,null,null,null,null,{"$f":"IF(I39>J39,I39-J39,0)","v":0},{"$f":"IF(C39<=TODAY(),IF(I39<J39,J39-I39,0),0)","v":0},null,"F",null,null,null,null,null,null,null,null,null,null,null,{"$f":"IF(AF39<>\"\",IF(E39<>\"\",ABS(24*60*(E39-AF39)),ABS(24*60*(G39-AF39))),0)","v":0},{"$f":"COUNTA(AF39,AI39,AK39,AM39)","v":0},null,{"$f":"IF(AI39<>\"\",IF(H39<>\"\",ABS(24*60*(H39-AI39)),ABS(24*60*(F39-AI39))),0)","v":0},null,{"$f":"IF(AK39<>\"\",IF(E39<>\"\",ABS(24*60*(E39-AK39)),ABS(24*60*(G39-AK39))),0)","v":0},null,{"$f":"IF(AM39<>\"\",IF(H39<>\"\",ABS(24*60*(H39-AM39)),ABS(24*60*(F39-AM39))),0)","v":0},null,null,{"$f":"AQ38+R39-S39","v":0}]
[null,null,"2020-10-27","2020-10-27",null,null,null,null,{"$f":"IF(LEN(F40)+LEN(H40)>0,IF(LEN(H40)>0,(HOUR(F40-E40)+MINUTE(F40-E40)/60)+(HOUR(H40-G40)+MINUTE(H40-G40)/60),(HOUR(F40-E40)+MINUTE(F40-E40)/60)),IF(Parameter!$F$29=1,J40,IF(T40=\"\",0,J40)))","v":0},null,null,null,null,null,null,null,null,{"$f":"IF(I40>J40,I40-J40,0)","v":0},{"$f":"IF(C40<=TODAY(),IF(I40<J40,J40-I40,0),0)","v":0},null,null,null,null,null,null,null,null,null,null,null,null,null,{"$f":"IF(AF40<>\"\",IF(E40<>\"\",ABS(24*60*(E40-AF40)),ABS(24*60*(G40-AF40))),0)","v":0},{"$f":"COUNTA(AF40,AI40,AK40,AM40)","v":0},null,{"$f":"IF(AI40<>\"\",IF(H40<>\"\",ABS(24*60*(H40-AI40)),ABS(24*60*(F40-AI40))),0)","v":0},null,{"$f":"IF(AK40<>\"\",IF(E40<>\"\",ABS(24*60*(E40-AK40)),ABS(24*60*(G40-AK40))),0)","v":0},null,{"$f":"IF(AM40<>\"\",IF(H40<>\"\",ABS(24*60*(H40-AM40)),ABS(24*60*(F40-AM40))),0)","v":0},null,null,{"$f":"AQ39+R40-S40","v":0}]
[null,null,"2020-10-28","2020-10-28",null,null,null,null,{"$f":"IF(LEN(F41)+LEN(H41)>0,IF(LEN(H41)>0,(HOUR(F41-E41)+MINUTE(F41-E41)/60)+(HOUR(H41-G41)+MINUTE(H41-G41)/60),(HOUR(F41-E41)+MINUTE(F41-E41)/60)),IF(Parameter!$F$29=1,J41,IF(T41=\"\",0,J41)))","v":0},null,null,null,null,null,null,null,null,{"$f":"IF(I41>J41,I41-J41,0)","v":0},{"$f":"IF(C41<=TODAY(),IF(I41<J41,J41-I41,0),0)","v":0},null,null,null,null,null,null,null,null,null,null,null,null,null,{"$f":"IF(AF41<>\"\",IF(E41<>\"\",ABS(24*60*(E41-AF41)),ABS(24*60*(G41-AF41))),0)","v":0},{"$f":"COUNTA(AF41,AI41,AK41,AM41)","v":0},null,{"$f":"IF(AI41<>\"\",IF(H41<>\"\",ABS(24*60*(H41-AI41)),ABS(24*60*(F41-AI41))),0)","v":0},null,{"$f":"IF(AK41<>\"\",IF(E41<>\"\",ABS(24*60*(E41-AK41)),ABS(24*60*(G41-AK41))),0)","v":0},null,{"$f":"IF(AM41<>\"\",IF(H41<>\"\",ABS(24*60*(H41-AM41)),ABS(24*60*(F41-AM41))),0)","v":0},null,null,{"$f":"AQ40+R41-S41","v":0}]
[null,null,"2020-10-29","2020-10-29",null,null,null,null,{"$f":"IF(LEN(F42)+LEN(H42)>0,IF(LEN(H42)>0,(HOUR(F42-E42)+MINUTE(F42-E42)/60)+(HOUR(H42-G42)+MINUTE(H42-G42)/60),(HOUR(F42-E42)+MINUTE(F42-E42)/60)),IF(Parameter!$F$29=1,J42,IF(T42=\"\",0,J42)))","v":0},null,null,null,null,null,null,null,null,{"$f":"IF(I42>J42,I42-J42,0)","v":0},{"$f":"IF(C42<=TODAY(),IF(I42<J42,J42-I42,0),0)","v":0},null,null,null,null,null,null,null,null,null,null,null,null,null,{"$f":"IF(AF42<>\"\",IF(E42<>\"\",ABS(24*60*(E42-AF42)),ABS(24*60*(G42-AF42))),0)","v":0},{"$f":"COUNTA(AF42,AI42,AK42,AM42)","v":0},null,{"$f":"IF(AI42<>\"\",IF(H42<>\"\",ABS(24*60*(H42-AI42)),ABS(24*60*(F42-AI42))),0)","v":0},null,{"$f":"IF(AK42<>\"\",IF(E42<>\"\",ABS(24*60*(E42-AK42)),ABS(24*60*(G42-AK42))),0)","v":0},null,{"$f":"IF(AM42<>\"\",IF(H42<>\"\",ABS(24*60*(H42-AM42)),ABS(24*60*(F42-AM42))),0)","v":0},null,null,{"$f":"AQ41+R42-S42","v":0}]
[null,null,{"$f":"IF(MONTH(C14)<>2,IF(MONTH(C42+1)>MONTH(C42),\"\",C42+1),\"\")","v":"2020-10-30"},"2020-10-30",null,null,null,null,{"$f":"IF(LEN(F43)+LEN(H43)>0,IF(LEN(H43)>0,(HOUR(F43-E43)+MINUTE(F43-E43)/60)+(HOUR(H43-G43)+MINUTE(H43-G43)/60),(HOUR(F43-E43)+MINUTE(F43-E43)/60)),IF(Parameter!$F$29=1,J43,IF(T43=\"\",0,J43)))","v":0},null,null,null,null,null,null,null,null,{"$f":"IF(I43>J43,I43-J43,0)","v":0},{"$f":"IF(C43<=TODAY(),IF(I43<J43,J43-I43,0),0)","v":0},null,null,null,null,null,null,null,null,null,null,null,null,null,{"$f":"IF(AF43<>\"\",IF(E43<>\"\",ABS(24*60*(E43-AF43)),ABS(24*60*(G43-AF43))),0)","v":0},{"$f":"COUNTA(AF43,AI43,AK43,AM43)","v":0},null,{"$f":"IF(AI43<>\"\",IF(H43<>\"\",ABS(24*60*(H43-AI43)),ABS(24*60*(F43-AI43))),0)","v":0},null,{"$f":"IF(AK43<>\"\",IF(E43<>\"\",ABS(24*60*(E43-AK43)),ABS(24*60*(G43-AK43))),0)","v":0},null,{"$f":"IF(AM43<>\"\",IF(H43<>\"\",ABS(24*60*(H43-AM43)),ABS(24*60*(F43-AM43))),0)","v":0},null,null,{"$f":"AQ42+R43-S43","v":0}]
[null,null,{"$f":"IF(MONTH(C14)<>2,IF(MONTH(C43+1)>MONTH(C43),\"\",C43+1),\"\")","v":"2020-10-31"},"2020-10-31",null,null,null,null,{"$f":"IF(LEN(F44)+LEN(H44)>0,IF(LEN(H44)>0,(HOUR(F44-E44)+MINUTE(F44-E44)/60)+(HOUR(H44-G44)+MINUTE(H44-G44)/60),(HOUR(F44-E44)+MINUTE(F44-E44)/60)),IF(Parameter!$F$29=1,J44,IF(T44=\"\",0,J44)))","v":0},null,null,null,null,null,null,null,null,{"$f":"IF(I44>J44,I44-J44,0)","v":0},{"$f":"IF(C44<=TODAY(),IF(I44<J44,J44-I44,0),0)","v":0},null,null,null,null,null,null,null,null,null,null,null,null,null,{"$f":"IF(AF44<>\"\",IF(E44<>\"\",ABS(24*60*(E44-AF44)),ABS(24*60*(G44-AF44))),0)","v":0},{"$f":"COUNTA(AF44,AI44,AK44,AM44)","v":0},null,{"$f":"IF(AI44<>\"\",IF(H44<>\"\",ABS(24*60*(H44-AI44)),ABS(24*60*(F44-AI44))),0)","v":0},null,{"$f":"IF(AK44<>\"\",IF(E44<>\"\",ABS(24*60*(E44-AK44)),ABS(24*60*(G44-AK44))),0)","v":0},null,{"$f":"IF(AM44<>\"\",IF(H44<>\"\",ABS(24*60*(H44-AM44)),ABS(24*60*(F44-AM44))),0)","v":0},null,null,{"$f":"AQ43+R44-S44","v":0}]
[null,null,null,null,null,null,null,"Summe:",{"$f":"ROUND(SUM(I14:I44),2)","v":0},{"$f":"ROUND(SUM(J13:J44),2)","v":0},{"$f":"SUM(K14:K44)","v":0},0,0,0,0,0,0,{"$f":"ROUND(SUM(R14:R44),2)","v":0},{"$f":"ROUND(SUM(S14:S44),2)","v":0},{"$f":"IF(COUNTA(T14:T44)=0,\"\",\"/U:\" & COUNTIF(T14:T44,\"u\")&\"/K:\" & COUNTIF(T14:T44,\"k\")&\"/Rest:\" & COUNTA(T14:T44)-COUNTIF(T14:T44,\"u\")-COUNTIF(T14:T44,\"k\"))","v":""},null,null,"Kontrollsummen:",null,null,null,null,null,null,null,null,null,null,null,null,null,null,null,null,null,null,null,null,{"$f":"SUM(AR14:AR44)","v":0},0,0,0,null,0,0,null,"Durchschnitt"]
[null,null,null,null,null,null,null,null,null,null,null,null,null,null,null,null,null,{"$f":"ROUND(R45-S45,2)","v":0},null,"Monatssaldo",null,null,{"$f":"\"IST-Stunden \"&ISTsumme&\" - SOLL-Stunden \"&SOLLsumme&\" =\"","v":"IST-Stunden 0 - SOLL-Stunden 0 ="},null,null,{"$f":"ISTsumme-SOLLsumme","v":0},null,null,null,null,null,null,null,null,null,null,null,null,null,null,null,null,null,null,null,null,null,null,null,null,null,{"$f":"IFERROR(SUM(AZ14:AZ44)/COUNTA(AZ14:AZ44),\"\")","v":""}]
[null,null,"Über-/Mehrstunden",null,null,{"$f":"ROUND(AT45+AU45,2)","v":0},"korr.Endsaldo inkl.Vorperiode:",null,null,null,null,null,null,null,null,null,null,{"$f":"ROUND(R9+R46,2)+F48","v":0},null,"Endsaldo inkl.Vorperiode",null,null,{"$f":"IF(M45<>0,\"minus automatische Überstunden:\",\"Monatssaldo (Zelle R46):\")","v":"Monatssaldo (Zelle R46):"},null,null,{"$f":"IF(M45<>0,-M45,R46)","v":0}]
[null,null,"Zeitsaldo Korrektur",null,null,{"$f":"ROUND((AS45-AT45),2)","v":0},null,null,null,null,null,null,null,null,null,null,null,null,null,"Auszahlung Gutstunden",null,null,{"$f":"IF(M45<>0,\"=Monatssaldo (Zelle R46):\",\"Differenz =\")","v":"Differenz ="},null,null,{"$f":"IF(M45<>0,(Z46+Z47),ROUND(Z46-Z47,1))","v":0}]
[null,null,"Info Lohn: ",null,null,null,null,null,null,null,null,null,null,null,null,null,null,{"$f":"R47-R48","v":0},null,"Vortrag abzgl.Auszahlg.",null,null,{"$f":"IF(M45<>0,\"Differenz =\",\"\")","v":""},null,null,{"$f":"IF(M45<>0,ROUND(Z48-R46,1),\"\")","v":""}]

{"sheet":"11 NOV","index":13,"n_rows":49,"n_cols":75,"rows_kept":49,"cut":false,"hidden":false,"merged":[[47,14,47,16],[47,17,47,18],[10,50,12,50],[10,44,12,44],[10,45,12,45],[10,46,12,46],[10,47,12,47],[10,48,12,48],[10,49,12,49],[10,14,12,14],[10,15,12,15],[10,16,12,16],[46,6,46,16],[10,10,12,10],[10,42,12,42],[10,12,12,12],[2,2,2,18],[6,26,7,26],[5,22,5,24],[10,51,12,51],[10,43,12,43],[7,16,8,16],[8,17,8,18],[8,4,8,8],[7,14,8,14],[7,15,8,15],[7,10,8,10],[7,11,8,11],[7,12,8,12],[7,13,8,13],[2,30,2,32],[2,34,2,35],[11,34,11,35],[0,22,0,26],[5,27,6,27],[8,26,9,26],[11,23,11,24],[11,25,11,26],[10,22,10,26],[11,22,12,22],[10,13,12,13],[10,19,12,19],[5,2,5,4],[7,2,7,3],[10,3,11,3],[11,6,11,7],[10,8,11,9],[8,2,8,3],[11,4,11,5],[10,4,10,7],[10,2,11,2],[5,5,5,8],[5,17,7,18],[7,4,7,8],[5,10,5,13],[45,8,45,9],[46,19,46,21],[5,16,6,16],[48,2,48,3],[48,4,48,9],[47,10,47,13],[46,2,46,4],[47,2,47,4],[47,6,47,9],[46,17,46,18],[10,11,12,11],[44,19,44,20],[45,17,45,18],[10,20,12,20],[11,17,11,18],[45,19,45,21],[48,22,48,24],[45,22,45,24],[46,22,46,24],[48,17,48,18],[47,19,47,21],[48,19,48,21],[47,22,47,24],[2,73,11,73],[2,74,11,74],[11,37,11,38],[2,69,11,69],[2,70,11,70],[2,71,11,71],[2,72,11,72],[2,37,2,38]]}
[]
[]
[null,null,null,null,null,null,null,null,null,null,null,null,null,null,null,null,null,null,null,null,null,null,null,null,null,null,null,null,null,null,null,null,null,null,null,null,null,null,null,null,null,null,null,null,null,null,null,null,null,null,null,null,null,null,null,null,null,null,null,null,null,null,null,null,null,null,null,null,null,{"$f":"IF(AND(Parameter!B69<>\"\"),Parameter!B69&\" \"&Parameter!E69&\"%\",\"\")","v":"Zuschlag vor DP-Beginn 25%"},{"$f":"IF(AND(Parameter!E70<>\"\",Parameter!F70<>\"\"),Parameter!B70&\" \"&TEXT(Parameter!F70,\"hh:mm\")&\" \"&Parameter!E70&\"%\",\"\")","v":"Zuschlag innerhalb DP \nnach 1.Uhrzeit 19:30 50%"},{"$f":"Parameter!B71&\" \"&TEXT(Parameter!F71,\"hh:mm\")&\" \"&Parameter!E71&\"%\"","v":"Zuschlag innerhalb DP \nnach 2.Uhrzeit 21:00 75%"},{"$f":"Parameter!B72&\" \"&TEXT(Parameter!F72,\"hh:mm\")&\" \"&Parameter!E72&\"%\"","v":"Zuschlag außerhalb DP \nnach 1.Uhrzeit 19:30 100%"},{"$f":"Parameter!B73&\" \"&TEXT(Parameter!F73,\"hh:mm\")&\" \"&Parameter!E73&\"%\"","v":"Zuschlag außerhalb DP \nnach 2.Uhrzeit 21:00 125%"},{"$f":"IF(AND(Parameter!B74<>\"\"),Parameter!B74&\" \"&Parameter!E74&\"%\",\"\")","v":"Zuschlag nach DP-Ende 150%"}]
[]
[]
[null,null,"Monat",null,null,{"$f":"MonatsErster+305","v":"2020-11-01"},null,null,null,null,"täglich",null,null,null,"So/Feier","Woche",{"$f":"IF(LEFT(Parameter!J62,1)=\"1\",\"Manuell\",\"Morgen Zeit\")","v":"Manuell"},"Vortrag\nVormonat"]
[]
[null,null,"MitarbeitNr.",null,{"$f":"IF('1 JAN'!E8<>\"\",'1 JAN'!E8,\"\")","v":""},null,null,null,null,null,{"$f":"Parameter!Q50","v":">21:00   100% Üh   "},{"$f":"Parameter!Q52","v":">19:30   50% Üh   "},{"$f":"Parameter!Q54","v":">9h                 50% Üh   "},{"$f":"Parameter!Q56","v":"> Soll-h bis 9 Std.                    50% Üh   "},{"$f":"Parameter!Q58","v":"So/Feiert 100% Üh   "},{"$f":"Parameter!Q60","v":">39h      100% Üh   "},{"$f":"Parameter!Q62","v":"manuell    50% Mh   "}]
[null,null,"Name:",null,{"$f":"IF('1 JAN'!E9<>\"\",'1 JAN'!E9,\"\")","v":""},null,null,null,null,null,null,null,null,null,null,null,null,{"$f":"IF(Parameter!F34=TRUE,'10 OKT'!R49:S49,0)","v":0}]
[null,null,null,{"$f":"IF(D16=\"Fr\",\"JA\",\"\")","v":""}]
[null,null,"Datum","Tag","tatsächliche Arbeitszeit",null,null,null," Gesamt\nStunden",null,{"$f":"MID(Parameter!F50,3,99)","v":"Grund-Stunde ZA - Zuschlag auszahlen"},{"$f":"MID(Parameter!F52,3,99)","v":"Grund-Stunde ZA - Zuschlag auszahlen"},{"$f":"MID(Parameter!F54,3,99)","v":"Grund-Stunde ZA - Zuschlag auszahlen"},{"$f":"MID(Parameter!F56,3,99)","v":"Grund-Stunde ZA - Zuschlag auszahlen"},{"$f":"MID(Parameter!F58,3,99)","v":"Grund-Stunde ZA - Zuschlag auszahlen"},{"$f":"MID(Parameter!F60,3,99)","v":"Grund-Stunde ZA - Zuschlag auszahlen"},{"$f":"MID(Parameter!F62,3,99)","v":"Grund-Stunde ZA - Zuschlag auszahlen"},"Gut-","Minus-"," Urlaub\nKrank\n\nU oder K \nmachen","Feiertag\n\nF-ix\nB-ewegl.",null,{"$f":"IF(AND(UPPER(Parameter!G68=\"AKTIV\"),UPPER(Parameter!R69=\"AKTIV\")),\"Dienstplan-Vorschlag übernehmen\",IF(UPPER(Parameter!G68=\"AKTIV\"),\"Dienstplan\",\"Manuelle Zeiterfassung\"))","v":"Manuelle Zeiterfassung"},null,null,null,null,null,null,null,null,null,null,null,null,null,null,null,null,null,null,null,"Aktueller\nTages\nSaldo","Summe Grundstunden\nim Zeitsaldo","Summe \nZuschlag \nZeitsaldo \nerhöhend","Summe Grundstunden\nzur Auszahlung","Summe \nZuschlag\nzur Auszahlung","Korrigierter Tagessaldo","Korrigierte \nTages IST-Std","Differenz SOLL-Std zu IST-Std inkl. Zeitsaldo Korrekturen","Tagesstunden + sonntags Summe Wochen-\nStunden","Wochen\nsumme \n(korrigiert)"]
[null,null,null,null,"Vormittag",null,"Nachmittag",null,null,null,null,null,null,null,null,null,null,"Stunden",null,null,null,null,{"$f":"IF(UPPER(Parameter!G68)=\"AKTIV\",\"Manuelle Zeiten in Spalte W sind monatlich manuell in die Spalten E-H zu übernehmen\",\"Begründung manuelle Zeiterfassung\")","v":"Begründung manuelle Zeiterfassung"},"Vormittag",null,"Nachmittag"]
[null,"OK",null,null,"von","bis","von","bis","Ist","Soll",null,null,null,null,null,null,null,"+","-",null,null,null,null,"von","bis","von","bis",null,null,null,"Anmerkung","Internet AN Vorm.","Differenz","Anzahl Internetzeiten","Internet AB Vorm","Differenz","Internet AN Nachm.","Differenz","Internet AB Nachm.","Differenz",null,null,null,null,null,null,null,null,null,null,null,null,null,null,null,null,null,null,null,null,null,null,null,null,null,null,null,null,null,{"$f":"SUM(BR14:BR44)","v":0},0,0,0,0,0]
[null,null,{"$f":"DATE('1 JAN'!G2,11,1)","v":"2020-11-01"},{"$f":"C14","v":"2020-11-01"},null,null,null,null,{"$f":"IF(LEN(F14)+LEN(H14)>0,IF(LEN(H14)>0,(HOUR(F14-E14)+MINUTE(F14-E14)/60)+(HOUR(H14-G14)+MINUTE(H14-G14)/60),(HOUR(F14-E14)+MINUTE(F14-E14)/60)),IF(Parameter!$F$29=1,J14,IF(T14=\"\",0,J14)))","v":0},null,null,null,null,null,null,null,null,{"$f":"IF(I14>J14,I14-J14,0)","v":0},{"$f":"IF(C14<=TODAY(),IF(I14<J14,J14-I14,0),0)","v":0},null,"F",null,null,null,null,null,null,null,null,null,null,null,{"$f":"IF(AF14<>\"\",IF(E14<>\"\",ABS(24*60*(E14-AF14)),ABS(24*60*(G14-AF14))),0)","v":0},{"$f":"COUNTA(AF14,AI14,AK14,AM14)","v":0},null,{"$f":"IF(AI14<>\"\",IF(H14<>\"\",ABS(24*60*(H14-AI14)),ABS(24*60*(F14-AI14))),0)","v":0},null,{"$f":"IF(AK14<>\"\",IF(E14<>\"\",ABS(24*60*(E14-AK14)),ABS(24*60*(G14-AK14))),0)","v":0},null,{"$f":"IF(AM14<>\"\",IF(H14<>\"\",ABS(24*60*(H14-AM14)),ABS(24*60*(F14-AM14))),0)","v":0},null,null,{"$f":"R9+R14-S14","v":0}]
[null,null,{"$f":"IF(MONTH(C14+1)>MONTH(C14),\"\",C14+1)","v":"2020-11-02"},"2020-11-02",null,null,null,null,{"$f":"IF(LEN(F15)+LEN(H15)>0,IF(LEN(H15)>0,(HOUR(F15-E15)+MINUTE(F15-E15)/60)+(HOUR(H15-G15)+MINUTE(H15-G15)/60),(HOUR(F15-E15)+MINUTE(F15-E15)/60)),IF(Parameter!$F$29=1,J15,IF(T15=\"\",0,J15)))","v":0},null,null,null,null,null,null,null,null,{"$f":"IF(I15>J15,I15-J15,0)","v":0},{"$f":"IF(C15<=TODAY(),IF(I15<J15,J15-I15,0),0)","v":0},null,null,null,null,null,null,null,null,null,null,null,null,null,{"$f":"IF(AF15<>\"\",IF(E15<>\"\",ABS(24*60*(E15-AF15)),ABS(24*60*(G15-AF15))),0)","v":0},{"$f":"COUNTA(AF15,AI15,AK15,AM15)","v":0},null,{"$f":"IF(AI15<>\"\",IF(H15<>\"\",ABS(24*60*(H15-AI15)),ABS(24*60*(F15-AI15))),0)","v":0},null,{"$f":"IF(AK15<>\"\",IF(E15<>\"\",ABS(24*60*(E15-AK15)),ABS(24*60*(G15-AK15))),0)","v":0},null,{"$f":"IF(AM15<>\"\",IF(H15<>\"\",ABS(24*60*(H15-AM15)),ABS(24*60*(F15-AM15))),0)","v":0},null,null,{"$f":"AQ14+R15-S15","v":0}]
[null,null,"2020-11-03","2020-11-03",null,null,null,null,{"$f":"IF(LEN(F16)+LEN(H16)>0,IF(LEN(H16)>0,(HOUR(F16-E16)+MINUTE(F16-E16)/60)+(HOUR(H16-G16)+MINUTE(H16-G16)/60),(HOUR(F16-E16)+MINUTE(F16-E16)/60)),IF(Parameter!$F$29=1,J16,IF(T16=\"\",0,J16)))","v":0},null,null,null,null,null,null,null,null,{"$f":"IF(I16>J16,I16-J16,0)","v":0},{"$f":"IF(C16<=TODAY(),IF(I16<J16,J16-I16,0),0)","v":0},null,null,null,null,null,null,null,null,null,null,null,null,null,{"$f":"IF(AF16<>\"\",IF(E16<>\"\",ABS(24*60*(E16-AF16)),ABS(24*60*(G16-AF16))),0)","v":0},{"$f":"COUNTA(AF16,AI16,AK16,AM16)","v":0},null,{"$f":"IF(AI16<>\"\",IF(H16<>\"\",ABS(24*60*(H16-AI16)),ABS(24*60*(F16-AI16))),0)","v":0},null,{"$f":"IF(AK16<>\"\",IF(E16<>\"\",ABS(24*60*(E16-AK16)),ABS(24*60*(G16-AK16))),0)","v":0},null,{"$f":"IF(AM16<>\"\",IF(H16<>\"\",ABS(24*60*(H16-AM16)),ABS(24*60*(F16-AM16))),0)","v":0},null,null,{"$f":"AQ15+R16-S16","v":0}]
[null,null,"2020-11-04","2020-11-04",null,null,null,null,{"$f":"IF(LEN(F17)+LEN(H17)>0,IF(LEN(H17)>0,(HOUR(F17-E17)+MINUTE(F17-E17)/60)+(HOUR(H17-G17)+MINUTE(H17-G17)/60),(HOUR(F17-E17)+MINUTE(F17-E17)/60)),IF(Parameter!$F$29=1,J17,IF(T17=\"\",0,J17)))","v":0},null,null,null,null,null,null,null,null,{"$f":"IF(I17>J17,I17-J17,0)","v":0},{"$f":"IF(C17<=TODAY(),IF(I17<J17,J17-I17,0),0)","v":0},null,null,null,null,null,null,null,null,null,null,null,null,null,{"$f":"IF(AF17<>\"\",IF(E17<>\"\",ABS(24*60*(E17-AF17)),ABS(24*60*(G17-AF17))),0)","v":0},{"$f":"COUNTA(AF17,AI17,AK17,AM17)","v":0},null,{"$f":"IF(AI17<>\"\",IF(H17<>\"\",ABS(24*60*(H17-AI17)),ABS(24*60*(F17-AI17))),0)","v":0},null,{"$f":"IF(AK17<>\"\",IF(E17<>\"\",ABS(24*60*(E17-AK17)),ABS(24*60*(G17-AK17))),0)","v":0},null,{"$f":"IF(AM17<>\"\",IF(H17<>\"\",ABS(24*60*(H17-AM17)),ABS(24*60*(F17-AM17))),0)","v":0},null,null,{"$f":"AQ16+R17-S17","v":0}]
[null,null,"2020-11-05","2020-11-05",null,null,null,null,{"$f":"IF(LEN(F18)+LEN(H18)>0,IF(LEN(H18)>0,(HOUR(F18-E18)+MINUTE(F18-E18)/60)+(HOUR(H18-G18)+MINUTE(H18-G18)/60),(HOUR(F18-E18)+MINUTE(F18-E18)/60)),IF(Parameter!$F$29=1,J18,IF(T18=\"\",0,J18)))","v":0},null,null,null,null,null,null,null,null,{"$f":"IF(I18>J18,I18-J18,0)","v":0},{"$f":"IF(C18<=TODAY(),IF(I18<J18,J18-I18,0),0)","v":0},null,null,null,null,null,null,null,null,null,null,null,null,null,{"$f":"IF(AF18<>\"\",IF(E18<>\"\",ABS(24*60*(E18-AF18)),ABS(24*60*(G18-AF18))),0)","v":0},{"$f":"COUNTA(AF18,AI18,AK18,AM18)","v":0},null,{"$f":"IF(AI18<>\"\",IF(H18<>\"\",ABS(24*60*(H18-AI18)),ABS(24*60*(F18-AI18))),0)","v":0},null,{"$f":"IF(AK18<>\"\",IF(E18<>\"\",ABS(24*60*(E18-AK18)),ABS(24*60*(G18-AK18))),0)","v":0},null,{"$f":"IF(AM18<>\"\",IF(H18<>\"\",ABS(24*60*(H18-AM18)),ABS(24*60*(F18-AM18))),0)","v":0},null,null,{"$f":"AQ17+R18-S18","v":0}]
[null,null,"2020-11-06","2020-11-06",null,null,null,null,{"$f":"IF(LEN(F19)+LEN(H19)>0,IF(LEN(H19)>0,(HOUR(F19-E19)+MINUTE(F19-E19)/60)+(HOUR(H19-G19)+MINUTE(H19-G19)/60),(HOUR(F19-E19)+MINUTE(F19-E19)/60)),IF(Parameter!$F$29=1,J19,IF(T19=\"\",0,J19)))","v":0},null,null,null,null,null,null,null,null,{"$f":"IF(I19>J19,I19-J19,0)","v":0},{"$f":"IF(C19<=TODAY(),IF(I19<J19,J19-I19,0),0)","v":0},null,null,null,null,null,null,null,null,null,null,null,null,null,{"$f":"IF(AF19<>\"\",IF(E19<>\"\",ABS(24*60*(E19-AF19)),ABS(24*60*(G19-AF19))),0)","v":0},{"$f":"COUNTA(AF19,AI19,AK19,AM19)","v":0},null,{"$f":"IF(AI19<>\"\",IF(H19<>\"\",ABS(24*60*(H19-AI19)),ABS(24*60*(F19-AI19))),0)","v":0},null,{"$f":"IF(AK19<>\"\",IF(E19<>\"\",ABS(24*60*(E19-AK19)),ABS(24*60*(G19-AK19))),0)","v":0},null,{"$f":"IF(AM19<>\"\",IF(H19<>\"\",ABS(24*60*(H19-AM19)),ABS(24*60*(F19-AM19))),0)","v":0},null,null,{"$f":"AQ18+R19-S19","v":0}]
[null,null,"2020-11-07","2020-11-07",null,null,null,null,{"$f":"IF(LEN(F20)+LEN(H20)>0,IF(LEN(H20)>0,(HOUR(F20-E20)+MINUTE(F20-E20)/60)+(HOUR(H20-G20)+MINUTE(H20-G20)/60),(HOUR(F20-E20)+MINUTE(F20-E20)/60)),IF(Parameter!$F$29=1,J20,IF(T20=\"\",0,J20)))","v":0},null,null,null,null,null,null,null,null,{"$f":"IF(I20>J20,I20-J20,0)","v":0},{"$f":"IF(C20<=TODAY(),IF(I20<J20,J20-I20,0),0)","v":0},null,null,null,null,null,null,null,null,null,null,null,null,null,{"$f":"IF(AF20<>\"\",IF(E20<>\"\",ABS(24*60*(E20-AF20)),ABS(24*60*(G20-AF20))),0)","v":0},{"$f":"COUNTA(AF20,AI20,AK20,AM20)","v":0},null,{"$f":"IF(AI20<>\"\",IF(H20<>\"\",ABS(24*60*(H20-AI20)),ABS(24*60*(F20-AI20))),0)","v":0},null,{"$f":"IF(AK20<>\"\",IF(E20<>\"\",ABS(24*60*(E20-AK20)),ABS(24*60*(G20-AK20))),0)","v":0},null,{"$f":"IF(AM20<>\"\",IF(H20<>\"\",ABS(24*60*(H20-AM20)),ABS(24*60*(F20-AM20))),0)","v":0},null,null,{"$f":"AQ19+R20-S20","v":0}]
[null,null,"2020-11-08","2020-11-08",null,null,null,null,{"$f":"IF(LEN(F21)+LEN(H21)>0,IF(LEN(H21)>0,(HOUR(F21-E21)+MINUTE(F21-E21)/60)+(HOUR(H21-G21)+MINUTE(H21-G21)/60),(HOUR(F21-E21)+MINUTE(F21-E21)/60)),IF(Parameter!$F$29=1,J21,IF(T21=\"\",0,J21)))","v":0},null,null,null,null,null,null,null,null,{"$f":"IF(I21>J21,I21-J21,0)","v":0},{"$f":"IF(C21<=TODAY(),IF(I21<J21,J21-I21,0),0)","v":0},null,null,null,null,null,null,null,null,null,null,null,null,null,{"$f":"IF(AF21<>\"\",IF(E21<>\"\",ABS(24*60*(E21-AF21)),ABS(24*60*(G21-AF21))),0)","v":0},{"$f":"COUNTA(AF21,AI21,AK21,AM21)","v":0},null,{"$f":"IF(AI21<>\"\",IF(H21<>\"\",ABS(24*60*(H21-AI21)),ABS(24*60*(F21-AI21))),0)","v":0},null,{"$f":"IF(AK21<>\"\",IF(E21<>\"\",ABS(24*60*(E21-AK21)),ABS(24*60*(G21-AK21))),0)","v":0},null,{"$f":"IF(AM21<>\"\",IF(H21<>\"\",ABS(24*60*(H21-AM21)),ABS(24*60*(F21-AM21))),0)","v":0},null,null,{"$f":"AQ20+R21-S21","v":0}]
[null,null,"2020-11-09","2020-11-09",null,null,null,null,{"$f":"IF(LEN(F22)+LEN(H22)>0,IF(LEN(H22)>0,(HOUR(F22-E22)+MINUTE(F22-E22)/60)+(HOUR(H22-G22)+MINUTE(H22-G22)/60),(HOUR(F22-E22)+MINUTE(F22-E22)/60)),IF(Parameter!$F$29=1,J22,IF(T22=\"\",0,J22)))","v":0},null,null,null,null,null,null,null,null,{"$f":"IF(I22>J22,I22-J22,0)","v":0},{"$f":"IF(C22<=TODAY(),IF(I22<J22,J22-I22,0),0)","v":0},null,null,null,null,null,null,null,null,null,null,null,null,null,{"$f":"IF(AF22<>\"\",IF(E22<>\"\",ABS(24*60*(E22-AF22)),ABS(24*60*(G22-AF22))),0)","v":0},{"$f":"COUNTA(AF22,AI22,AK22,AM22)","v":0},null,{"$f":"IF(AI22<>\"\",IF(H22<>\"\",ABS(24*60*(H22-AI22)),ABS(24*60*(F22-AI22))),0)","v":0},null,{"$f":"IF(AK22<>\"\",IF(E22<>\"\",ABS(24*60*(E22-AK22)),ABS(24*60*(G22-AK22))),0)","v":0},null,{"$f":"IF(AM22<>\"\",IF(H22<>\"\",ABS(24*60*(H22-AM22)),ABS(24*60*(F22-AM22))),0)","v":0},null,null,{"$f":"AQ21+R22-S22","v":0}]
[null,null,"2020-11-10","2020-11-10",null,null,null,null,{"$f":"IF(LEN(F23)+LEN(H23)>0,IF(LEN(H23)>0,(HOUR(F23-E23)+MINUTE(F23-E23)/60)+(HOUR(H23-G23)+MINUTE(H23-G23)/60),(HOUR(F23-E23)+MINUTE(F23-E23)/60)),IF(Parameter!$F$29=1,J23,IF(T23=\"\",0,J23)))","v":0},null,null,null,null,null,null,null,null,{"$f":"IF(I23>J23,I23-J23,0)","v":0},{"$f":"IF(C23<=TODAY(),IF(I23<J23,J23-I23,0),0)","v":0},null,null,null,null,null,null,null,null,null,null,null,null,null,{"$f":"IF(AF23<>\"\",IF(E23<>\"\",ABS(24*60*(E23-AF23)),ABS(24*60*(G23-AF23))),0)","v":0},{"$f":"COUNTA(AF23,AI23,AK23,AM23)","v":0},null,{"$f":"IF(AI23<>\"\",IF(H23<>\"\",ABS(24*60*(H23-AI23)),ABS(24*60*(F23-AI23))),0)","v":0},null,{"$f":"IF(AK23<>\"\",IF(E23<>\"\",ABS(24*60*(E23-AK23)),ABS(24*60*(G23-AK23))),0)","v":0},null,{"$f":"IF(AM23<>\"\",IF(H23<>\"\",ABS(24*60*(H23-AM23)),ABS(24*60*(F23-AM23))),0)","v":0},null,null,{"$f":"AQ22+R23-S23","v":0}]
[null,null,"2020-11-11","2020-11-11",null,null,null,null,{"$f":"IF(LEN(F24)+LEN(H24)>0,IF(LEN(H24)>0,(HOUR(F24-E24)+MINUTE(F24-E24)/60)+(HOUR(H24-G24)+MINUTE(H24-G24)/60),(HOUR(F24-E24)+MINUTE(F24-E24)/60)),IF(Parameter!$F$29=1,J24,IF(T24=\"\",0,J24)))","v":0},null,null,null,null,null,null,null,null,{"$f":"IF(I24>J24,I24-J24,0)","v":0},{"$f":"IF(C24<=TODAY(),IF(I24<J24,J24-I24,0),0)","v":0},null,null,null,null,null,null,null,null,null,null,null,null,null,{"$f":"IF(AF24<>\"\",IF(E24<>\"\",ABS(24*60*(E24-AF24)),ABS(24*60*(G24-AF24))),0)","v":0},{"$f":"COUNTA(AF24,AI24,AK24,AM24)","v":0},null,{"$f":"IF(AI24<>\"\",IF(H24<>\"\",ABS(24*60*(H24-AI24)),ABS(24*60*(F24-AI24))),0)","v":0},null,{"$f":"IF(AK24<>\"\",IF(E24<>\"\",ABS(24*60*(E24-AK24)),ABS(24*60*(G24-AK24))),0)","v":0},null,{"$f":"IF(AM24<>\"\",IF(H24<>\"\",ABS(24*60*(H24-AM24)),ABS(24*60*(F24-AM24))),0)","v":0},null,null,{"$f":"AQ23+R24-S24","v":0}]
[null,null,"2020-11-12","2020-11-12",null,null,null,null,{"$f":"IF(LEN(F25)+LEN(H25)>0,IF(LEN(H25)>0,(HOUR(F25-E25)+MINUTE(F25-E25)/60)+(HOUR(H25-G25)+MINUTE(H25-G25)/60),(HOUR(F25-E25)+MINUTE(F25-E25)/60)),IF(Parameter!$F$29=1,J25,IF(T25=\"\",0,J25)))","v":0},null,null,null,null,null,null,null,null,{"$f":"IF(I25>J25,I25-J25,0)","v":0},{"$f":"IF(C25<=TODAY(),IF(I25<J25,J25-I25,0),0)","v":0},null,null,null,null,null,null,null,null,null,null,null,null,null,{"$f":"IF(AF25<>\"\",IF(E25<>\"\",ABS(24*60*(E25-AF25)),ABS(24*60*(G25-AF25))),0)","v":0},{"$f":"COUNTA(AF25,AI25,AK25,AM25)","v":0},null,{"$f":"IF(AI25<>\"\",IF(H25<>\"\",ABS(24*60*(H25-AI25)),ABS(24*60*(F25-AI25))),0)","v":0},null,{"$f":"IF(AK25<>\"\",IF(E25<>\"\",ABS(24*60*(E25-AK25)),ABS(24*60*(G25-AK25))),0)","v":0},null,{"$f":"IF(AM25<>\"\",IF(H25<>\"\",ABS(24*60*(H25-AM25)),ABS(24*60*(F25-AM25))),0)","v":0},null,null,{"$f":"AQ24+R25-S25","v":0}]
[null,null,"2020-11-13","2020-11-13",null,null,null,null,{"$f":"IF(LEN(F26)+LEN(H26)>0,IF(LEN(H26)>0,(HOUR(F26-E26)+MINUTE(F26-E26)/60)+(HOUR(H26-G26)+MINUTE(H26-G26)/60),(HOUR(F26-E26)+MINUTE(F26-E26)/60)),IF(Parameter!$F$29=1,J26,IF(T26=\"\",0,J26)))","v":0},null,null,null,null,null,null,null,null,{"$f":"IF(I26>J26,I26-J26,0)","v":0},{"$f":"IF(C26<=TODAY(),IF(I26<J26,J26-I26,0),0)","v":0},null,null,null,null,null,null,null,null,null,null,null,null,null,{"$f":"IF(AF26<>\"\",IF(E26<>\"\",ABS(24*60*(E26-AF26)),ABS(24*60*(G26-AF26))),0)","v":0},{"$f":"COUNTA(AF26,AI26,AK26,AM26)","v":0},null,{"$f":"IF(AI26<>\"\",IF(H26<>\"\",ABS(24*60*(H26-AI26)),ABS(24*60*(F26-AI26))),0)","v":0},null,{"$f":"IF(AK26<>\"\",IF(E26<>\"\",ABS(24*60*(E26-AK26)),ABS(24*60*(G26-AK26))),0)","v":0},null,{"$f":"IF(AM26<>\"\",IF(H26<>\"\",ABS(24*60*(H26-AM26)),ABS(24*60*(F26-AM26))),0)","v":0},null,null,{"$f":"AQ25+R26-S26","v":0}]
[null,null,"2020-11-14","2020-11-14",null,null,null,null,{"$f":"IF(LEN(F27)+LEN(H27)>0,IF(LEN(H27)>0,(HOUR(F27-E27)+MINUTE(F27-E27)/60)+(HOUR(H27-G27)+MINUTE(H27-G27)/60),(HOUR(F27-E27)+MINUTE(F27-E27)/60)),IF(Parameter!$F$29=1,J27,IF(T27=\"\",0,J27)))","v":0},null,null,null,null,null,null,null,null,{"$f":"IF(I27>J27,I27-J27,0)","v":0},{"$f":"IF(C27<=TODAY(),IF(I27<J27,J27-I27,0),0)","v":0},null,null,null,null,null,null,null,null,null,null,null,null,null,{"$f":"IF(AF27<>\"\",IF(E27<>\"\",ABS(24*60*(E27-AF27)),ABS(24*60*(G27-AF27))),0)","v":0},{"$f":"COUNTA(AF27,AI27,AK27,AM27)","v":0},null,{"$f":"IF(AI27<>\"\",IF(H27<>\"\",ABS(24*60*(H27-AI27)),ABS(24*60*(F27-AI27))),0)","v":0},null,{"$f":"IF(AK27<>\"\",IF(E27<>\"\",ABS(24*60*(E27-AK27)),ABS(24*60*(G27-AK27))),0)","v":0},null,{"$f":"IF(AM27<>\"\",IF(H27<>\"\",ABS(24*60*(H27-AM27)),ABS(24*60*(F27-AM27))),0)","v":0},null,null,{"$f":"AQ26+R27-S27","v":0}]
[null,null,"2020-11-15","2020-11-15",null,null,null,null,{"$f":"IF(LEN(F28)+LEN(H28)>0,IF(LEN(H28)>0,(HOUR(F28-E28)+MINUTE(F28-E28)/60)+(HOUR(H28-G28)+MINUTE(H28-G28)/60),(HOUR(F28-E28)+MINUTE(F28-E28)/60)),IF(Parameter!$F$29=1,J28,IF(T28=\"\",0,J28)))","v":0},null,null,null,null,null,null,null,null,{"$f":"IF(I28>J28,I28-J28,0)","v":0},{"$f":"IF(C28<=TODAY(),IF(I28<J28,J28-I28,0),0)","v":0},null,null,null,null,null,null,null,null,null,null,null,null,null,{"$f":"IF(AF28<>\"\",IF(E28<>\"\",ABS(24*60*(E28-AF28)),ABS(24*60*(G28-AF28))),0)","v":0},{"$f":"COUNTA(AF28,AI28,AK28,AM28)","v":0},null,{"$f":"IF(AI28<>\"\",IF(H28<>\"\",ABS(24*60*(H28-AI28)),ABS(24*60*(F28-AI28))),0)","v":0},null,{"$f":"IF(AK28<>\"\",IF(E28<>\"\",ABS(24*60*(E28-AK28)),ABS(24*60*(G28-AK28))),0)","v":0},null,{"$f":"IF(AM28<>\"\",IF(H28<>\"\",ABS(24*60*(H28-AM28)),ABS(24*60*(F28-AM28))),0)","v":0},null,null,{"$f":"AQ27+R28-S28","v":0}]
[null,null,"2020-11-16","2020-11-16",null,null,null,null,{"$f":"IF(LEN(F29)+LEN(H29)>0,IF(LEN(H29)>0,(HOUR(F29-E29)+MINUTE(F29-E29)/60)+(HOUR(H29-G29)+MINUTE(H29-G29)/60),(HOUR(F29-E29)+MINUTE(F29-E29)/60)),IF(Parameter!$F$29=1,J29,IF(T29=\"\",0,J29)))","v":0},null,null,null,null,null,null,null,null,{"$f":"IF(I29>J29,I29-J29,0)","v":0},{"$f":"IF(C29<=TODAY(),IF(I29<J29,J29-I29,0),0)","v":0},null,null,null,null,null,null,null,null,null,null,null,null,null,{"$f":"IF(AF29<>\"\",IF(E29<>\"\",ABS(24*60*(E29-AF29)),ABS(24*60*(G29-AF29))),0)","v":0},{"$f":"COUNTA(AF29,AI29,AK29,AM29)","v":0},null,{"$f":"IF(AI29<>\"\",IF(H29<>\"\",ABS(24*60*(H29-AI29)),ABS(24*60*(F29-AI29))),0)","v":0},null,{"$f":"IF(AK29<>\"\",IF(E29<>\"\",ABS(24*60*(E29-AK29)),ABS(24*60*(G29-AK29))),0)","v":0},null,{"$f":"IF(AM29<>\"\",IF(H29<>\"\",ABS(24*60*(H29-AM29)),ABS(24*60*(F29-AM29))),0)","v":0},null,null,{"$f":"AQ28+R29-S29","v":0}]
[null,null,"2020-11-17","2020-11-17",null,null,null,null,{"$f":"IF(LEN(F30)+LEN(H30)>0,IF(LEN(H30)>0,(HOUR(F30-E30)+MINUTE(F30-E30)/60)+(HOUR(H30-G30)+MINUTE(H30-G30)/60),(HOUR(F30-E30)+MINUTE(F30-E30)/60)),IF(Parameter!$F$29=1,J30,IF(T30=\"\",0,J30)))","v":0},null,null,null,null,null,null,null,null,{"$f":"IF(I30>J30,I30-J30,0)","v":0},{"$f":"IF(C30<=TODAY(),IF(I30<J30,J30-I30,0),0)","v":0},null,null,null,null,null,null,null,null,null,null,null,null,null,{"$f":"IF(AF30<>\"\",IF(E30<>\"\",ABS(24*60*(E30-AF30)),ABS(24*60*(G30-AF30))),0)","v":0},{"$f":"COUNTA(AF30,AI30,AK30,AM30)","v":0},null,{"$f":"IF(AI30<>\"\",IF(H30<>\"\",ABS(24*60*(H30-AI30)),ABS(24*60*(F30-AI30))),0)","v":0},null,{"$f":"IF(AK30<>\"\",IF(E30<>\"\",ABS(24*60*(E30-AK30)),ABS(24*60*(G30-AK30))),0)","v":0},null,{"$f":"IF(AM30<>\"\",IF(H30<>\"\",ABS(24*60*(H30-AM30)),ABS(24*60*(F30-AM30))),0)","v":0},null,null,{"$f":"AQ29+R30-S30","v":0}]
[null,null,"2020-11-18","2020-11-18",null,null,null,null,{"$f":"IF(LEN(F31)+LEN(H31)>0,IF(LEN(H31)>0,(HOUR(F31-E31)+MINUTE(F31-E31)/60)+(HOUR(H31-G31)+MINUTE(H31-G31)/60),(HOUR(F31-E31)+MINUTE(F31-E31)/60)),IF(Parameter!$F$29=1,J31,IF(T31=\"\",0,J31)))","v":0},null,null,null,null,null,null,null,null,{"$f":"IF(I31>J31,I31-J31,0)","v":0},{"$f":"IF(C31<=TODAY(),IF(I31<J31,J31-I31,0),0)","v":0},null,null,null,null,null,null,null,null,null,null,null,null,null,{"$f":"IF(AF31<>\"\",IF(E31<>\"\",ABS(24*60*(E31-AF31)),ABS(24*60*(G31-AF31))),0)","v":0},{"$f":"COUNTA(AF31,AI31,AK31,AM31)","v":0},null,{"$f":"IF(AI31<>\"\",IF(H31<>\"\",ABS(24*60*(H31-AI31)),ABS(24*60*(F31-AI31))),0)","v":0},null,{"$f":"IF(AK31<>\"\",IF(E31<>\"\",ABS(24*60*(E31-AK31)),ABS(24*60*(G31-AK31))),0)","v":0},null,{"$f":"IF(AM31<>\"\",IF(H31<>\"\",ABS(24*60*(H31-AM31)),ABS(24*60*(F31-AM31))),0)","v":0},null,null,{"$f":"AQ30+R31-S31","v":0}]
[null,null,"2020-11-19","2020-11-19",null,null,null,null,{"$f":"IF(LEN(F32)+LEN(H32)>0,IF(LEN(H32)>0,(HOUR(F32-E32)+MINUTE(F32-E32)/60)+(HOUR(H32-G32)+MINUTE(H32-G32)/60),(HOUR(F32-E32)+MINUTE(F32-E32)/60)),IF(Parameter!$F$29=1,J32,IF(T32=\"\",0,J32)))","v":0},null,null,null,null,null,null,null,null,{"$f":"IF(I32>J32,I32-J32,0)","v":0},{"$f":"IF(C32<=TODAY(),IF(I32<J32,J32-I32,0),0)","v":0},null,null,null,null,null,null,null,null,null,null,null,null,null,{"$f":"IF(AF32<>\"\",IF(E32<>\"\",ABS(24*60*(E32-AF32)),ABS(24*60*(G32-AF32))),0)","v":0},{"$f":"COUNTA(AF32,AI32,AK32,AM32)","v":0},null,{"$f":"IF(AI32<>\"\",IF(H32<>\"\",ABS(24*60*(H32-AI32)),ABS(24*60*(F32-AI32))),0)","v":0},null,{"$f":"IF(AK32<>\"\",IF(E32<>\"\",ABS(24*60*(E32-AK32)),ABS(24*60*(G32-AK32))),0)","v":0},null,{"$f":"IF(AM32<>\"\",IF(H32<>\"\",ABS(24*60*(H32-AM32)),ABS(24*60*(F32-AM32))),0)","v":0},null,null,{"$f":"AQ31+R32-S32","v":0}]
[null,null,"2020-11-20","2020-11-20",null,null,null,null,{"$f":"IF(LEN(F33)+LEN(H33)>0,IF(LEN(H33)>0,(HOUR(F33-E33)+MINUTE(F33-E33)/60)+(HOUR(H33-G33)+MINUTE(H33-G33)/60),(HOUR(F33-E33)+MINUTE(F33-E33)/60)),IF(Parameter!$F$29=1,J33,IF(T33=\"\",0,J33)))","v":0},null,null,null,null,null,null,null,null,{"$f":"IF(I33>J33,I33-J33,0)","v":0},{"$f":"IF(C33<=TODAY(),IF(I33<J33,J33-I33,0),0)","v":0},null,null,null,null,null,null,null,null,null,null,null,null,null,{"$f":"IF(AF33<>\"\",IF(E33<>\"\",ABS(24*60*(E33-AF33)),ABS(24*60*(G33-AF33))),0)","v":0},{"$f":"COUNTA(AF33,AI33,AK33,AM33)","v":0},null,{"$f":"IF(AI33<>\"\",IF(H33<>\"\",ABS(24*60*(H33-AI33)),ABS(24*60*(F33-AI33))),0)","v":0},null,{"$f":"IF(AK33<>\"\",IF(E33<>\"\",ABS(24*60*(E33-AK33)),ABS(24*60*(G33-AK33))),0)","v":0},null,{"$f":"IF(AM33<>\"\",IF(H33<>\"\",ABS(24*60*(H33-AM33)),ABS(24*60*(F33-AM33))),0)","v":0},null,null,{"$f":"AQ32+R33-S33","v":0}]
[null,null,"2020-11-21","2020-11-21",null,null,null,null,{"$f":"IF(LEN(F34)+LEN(H34)>0,IF(LEN(H34)>0,(HOUR(F34-E34)+MINUTE(F34-E34)/60)+(HOUR(H34-G34)+MINUTE(H34-G34)/60),(HOUR(F34-E34)+MINUTE(F34-E34)/60)),IF(Parameter!$F$29=1,J34,IF(T34=\"\",0,J34)))","v":0},null,null,null,null,null,null,null,null,{"$f":"IF(I34>J34,I34-J34,0)","v":0},{"$f":"IF(C34<=TODAY(),IF(I34<J34,J34-I34,0),0)","v":0},null,null,null,null,null,null,null,null,null,null,null,null,null,{"$f":"IF(AF34<>\"\",IF(E34<>\"\",ABS(24*60*(E34-AF34)),ABS(24*60*(G34-AF34))),0)","v":0},{"$f":"COUNTA(AF34,AI34,AK34,AM34)","v":0},null,{"$f":"IF(AI34<>\"\",IF(H34<>\"\",ABS(24*60*(H34-AI34)),ABS(24*60*(F34-AI34))),0)","v":0},null,{"$f":"IF(AK34<>\"\",IF(E34<>\"\",ABS(24*60*(E34-AK34)),ABS(24*60*(G34-AK34))),0)","v":0},null,{"$f":"IF(AM34<>\"\",IF(H34<>\"\",ABS(24*60*(H34-AM34)),ABS(24*60*(F34-AM34))),0)","v":0},null,null,{"$f":"AQ33+R34-S34","v":0}]
[null,null,"2020-11-22","2020-11-22",null,null,null,null,{"$f":"IF(LEN(F35)+LEN(H35)>0,IF(LEN(H35)>0,(HOUR(F35-E35)+MINUTE(F35-E35)/60)+(HOUR(H35-G35)+MINUTE(H35-G35)/60),(HOUR(F35-E35)+MINUTE(F35-E35)/60)),IF(Parameter!$F$29=1,J35,IF(T35=\"\",0,J35)))","v":0},null,null,null,null,null,null,null,null,{"$f":"IF(I35>J35,I35-J35,0)","v":0},{"$f":"IF(C35<=TODAY(),IF(I35<J35,J35-I35,0),0)","v":0},null,null,null,null,null,null,null,null,null,null,null,null,null,{"$f":"IF(AF35<>\"\",IF(E35<>\"\",ABS(24*60*(E35-AF35)),ABS(24*60*(G35-AF35))),0)","v":0},{"$f":"COUNTA(AF35,AI35,AK35,AM35)","v":0},null,{"$f":"IF(AI35<>\"\",IF(H35<>\"\",ABS(24*60*(H35-AI35)),ABS(24*60*(F35-AI35))),0)","v":0},null,{"$f":"IF(AK35<>\"\",IF(E35<>\"\",ABS(24*60*(E35-AK35)),ABS(24*60*(G35-AK35))),0)","v":0},null,{"$f":"IF(AM35<>\"\",IF(H35<>\"\",ABS(24*60*(H35-AM35)),ABS(24*60*(F35-AM35))),0)","v":0},null,null,{"$f":"AQ34+R35-S35","v":0}]
[null,null,"2020-11-23","2020-11-23",null,null,null,null,{"$f":"IF(LEN(F36)+LEN(H36)>0,IF(LEN(H36)>0,(HOUR(F36-E36)+MINUTE(F36-E36)/60)+(HOUR(H36-G36)+MINUTE(H36-G36)/60),(HOUR(F36-E36)+MINUTE(F36-E36)/60)),IF(Parameter!$F$29=1,J36,IF(T36=\"\",0,J36)))","v":0},null,null,null,null,null,null,null,null,{"$f":"IF(I36>J36,I36-J36,0)","v":0},{"$f":"IF(C36<=TODAY(),IF(I36<J36,J36-I36,0),0)","v":0},null,null,null,null,null,null,null,null,null,null,null,null,null,{"$f":"IF(AF36<>\"\",IF(E36<>\"\",ABS(24*60*(E36-AF36)),ABS(24*60*(G36-AF36))),0)","v":0},{"$f":"COUNTA(AF36,AI36,AK36,AM36)","v":0},null,{"$f":"IF(AI36<>\"\",IF(H36<>\"\",ABS(24*60*(H36-AI36)),ABS(24*60*(F36-AI36))),0)","v":0},null,{"$f":"IF(AK36<>\"\",IF(E36<>\"\",ABS(24*60*(E36-AK36)),ABS(24*60*(G36-AK36))),0)","v":0},null,{"$f":"IF(AM36<>\"\",IF(H36<>\"\",ABS(24*60*(H36-AM36)),ABS(24*60*(F36-AM36))),0)","v":0},null,null,{"$f":"AQ35+R36-S36","v":0}]
[null,null,"2020-11-24","2020-11-24",null,null,null,null,{"$f":"IF(LEN(F37)+LEN(H37)>0,IF(LEN(H37)>0,(HOUR(F37-E37)+MINUTE(F37-E37)/60)+(HOUR(H37-G37)+MINUTE(H37-G37)/60),(HOUR(F37-E37)+MINUTE(F37-E37)/60)),IF(Parameter!$F$29=1,J37,IF(T37=\"\",0,J37)))","v":0},null,null,null,null,null,null,null,null,{"$f":"IF(I37>J37,I37-J37,0)","v":0},{"$f":"IF(C37<=TODAY(),IF(I37<J37,J37-I37,0),0)","v":0},null,null,null,null,null,null,null,null,null,null,null,null,null,{"$f":"IF(AF37<>\"\",IF(E37<>\"\",ABS(24*60*(E37-AF37)),ABS(24*60*(G37-AF37))),0)","v":0},{"$f":"COUNTA(AF37,AI37,AK37,AM37)","v":0},null,{"$f":"IF(AI37<>\"\",IF(H37<>\"\",ABS(24*60*(H37-AI37)),ABS(24*60*(F37-AI37))),0)","v":0},null,{"$f":"IF(AK37<>\"\",IF(E37<>\"\",ABS(24*60*(E37-AK37)),ABS(24*60*(G37-AK37))),0)","v":0},null,{"$f":"IF(AM37<>\"\",IF(H37<>\"\",ABS(24*60*(H37-AM37)),ABS(24*60*(F37-AM37))),0)","v":0},null,null,{"$f":"AQ36+R37-S37","v":0}]
[null,null,"2020-11-25","2020-11-25",null,null,null,null,{"$f":"IF(LEN(F38)+LEN(H38)>0,IF(LEN(H38)>0,(HOUR(F38-E38)+MINUTE(F38-E38)/60)+(HOUR(H38-G38)+MINUTE(H38-G38)/60),(HOUR(F38-E38)+MINUTE(F38-E38)/60)),IF(Parameter!$F$29=1,J38,IF(T38=\"\",0,J38)))","v":0},null,null,null,null,null,null,null,null,{"$f":"IF(I38>J38,I38-J38,0)","v":0},{"$f":"IF(C38<=TODAY(),IF(I38<J38,J38-I38,0),0)","v":0},null,null,null,null,null,null,null,null,null,null,null,null,null,{"$f":"IF(AF38<>\"\",IF(E38<>\"\",ABS(24*60*(E38-AF38)),ABS(24*60*(G38-AF38))),0)","v":0},{"$f":"COUNTA(AF38,AI38,AK38,AM38)","v":0},null,{"$f":"IF(AI38<>\"\",IF(H38<>\"\",ABS(24*60*(H38-AI38)),ABS(24*60*(F38-AI38))),0)","v":0},null,{"$f":"IF(AK38<>\"\",IF(E38<>\"\",ABS(24*60*(E38-AK38)),ABS(24*60*(G38-AK38))),0)","v":0},null,{"$f":"IF(AM38<>\"\",IF(H38<>\"\",ABS(24*60*(H38-AM38)),ABS(24*60*(F38-AM38))),0)","v":0},null,null,{"$f":"AQ37+R38-S38","v":0}]
[null,null,"2020-11-26","2020-11-26",null,null,null,null,{"$f":"IF(LEN(F39)+LEN(H39)>0,IF(LEN(H39)>0,(HOUR(F39-E39)+MINUTE(F39-E39)/60)+(HOUR(H39-G39)+MINUTE(H39-G39)/60),(HOUR(F39-E39)+MINUTE(F39-E39)/60)),IF(Parameter!$F$29=1,J39,IF(T39=\"\",0,J39)))","v":0},null,null,null,null,null,null,null,null,{"$f":"IF(I39>J39,I39-J39,0)","v":0},{"$f":"IF(C39<=TODAY(),IF(I39<J39,J39-I39,0),0)","v":0},null,null,null,null,null,null,null,null,null,null,null,null,null,{"$f":"IF(AF39<>\"\",IF(E39<>\"\",ABS(24*60*(E39-AF39)),ABS(24*60*(G39-AF39))),0)","v":0},{"$f":"COUNTA(AF39,AI39,AK39,AM39)","v":0},null,{"$f":"IF(AI39<>\"\",IF(H39<>\"\",ABS(24*60*(H39-AI39)),ABS(24*60*(F39-AI39))),0)","v":0},null,{"$f":"IF(AK39<>\"\",IF(E39<>\"\",ABS(24*60*(E39-AK39)),ABS(24*60*(G39-AK39))),0)","v":0},null,{"$f":"IF(AM39<>\"\",IF(H39<>\"\",ABS(24*60*(H39-AM39)),ABS(24*60*(F39-AM39))),0)","v":0},null,null,{"$f":"AQ38+R39-S39","v":0}]
[null,null,"2020-11-27","2020-11-27",null,null,null,null,{"$f":"IF(LEN(F40)+LEN(H40)>0,IF(LEN(H40)>0,(HOUR(F40-E40)+MINUTE(F40-E40)/60)+(HOUR(H40-G40)+MINUTE(H40-G40)/60),(HOUR(F40-E40)+MINUTE(F40-E40)/60)),IF(Parameter!$F$29=1,J40,IF(T40=\"\",0,J40)))","v":0},null,null,null,null,null,null,null,null,{"$f":"IF(I40>J40,I40-J40,0)","v":0},{"$f":"IF(C40<=TODAY(),IF(I40<J40,J40-I40,0),0)","v":0},null,null,null,null,null,null,null,null,null,null,null,null,null,{"$f":"IF(AF40<>\"\",IF(E40<>\"\",ABS(24*60*(E40-AF40)),ABS(24*60*(G40-AF40))),0)","v":0},{"$f":"COUNTA(AF40,AI40,AK40,AM40)","v":0},null,{"$f":"IF(AI40<>\"\",IF(H40<>\"\",ABS(24*60*(H40-AI40)),ABS(24*60*(F40-AI40))),0)","v":0},null,{"$f":"IF(AK40<>\"\",IF(E40<>\"\",ABS(24*60*(E40-AK40)),ABS(24*60*(G40-AK40))),0)","v":0},null,{"$f":"IF(AM40<>\"\",IF(H40<>\"\",ABS(24*60*(H40-AM40)),ABS(24*60*(F40-AM40))),0)","v":0},null,null,{"$f":"AQ39+R40-S40","v":0}]
[null,null,"2020-11-28","2020-11-28",null,null,null,null,{"$f":"IF(LEN(F41)+LEN(H41)>0,IF(LEN(H41)>0,(HOUR(F41-E41)+MINUTE(F41-E41)/60)+(HOUR(H41-G41)+MINUTE(H41-G41)/60),(HOUR(F41-E41)+MINUTE(F41-E41)/60)),IF(Parameter!$F$29=1,J41,IF(T41=\"\",0,J41)))","v":0},null,null,null,null,null,null,null,null,{"$f":"IF(I41>J41,I41-J41,0)","v":0},{"$f":"IF(C41<=TODAY(),IF(I41<J41,J41-I41,0),0)","v":0},null,null,null,null,null,null,null,null,null,null,null,null,null,{"$f":"IF(AF41<>\"\",IF(E41<>\"\",ABS(24*60*(E41-AF41)),ABS(24*60*(G41-AF41))),0)","v":0},{"$f":"COUNTA(AF41,AI41,AK41,AM41)","v":0},null,{"$f":"IF(AI41<>\"\",IF(H41<>\"\",ABS(24*60*(H41-AI41)),ABS(24*60*(F41-AI41))),0)","v":0},null,{"$f":"IF(AK41<>\"\",IF(E41<>\"\",ABS(24*60*(E41-AK41)),ABS(24*60*(G41-AK41))),0)","v":0},null,{"$f":"IF(AM41<>\"\",IF(H41<>\"\",ABS(24*60*(H41-AM41)),ABS(24*60*(F41-AM41))),0)","v":0},null,null,{"$f":"AQ40+R41-S41","v":0}]
[null,null,"2020-11-29","2020-11-29",null,null,null,null,{"$f":"IF(LEN(F42)+LEN(H42)>0,IF(LEN(H42)>0,(HOUR(F42-E42)+MINUTE(F42-E42)/60)+(HOUR(H42-G42)+MINUTE(H42-G42)/60),(HOUR(F42-E42)+MINUTE(F42-E42)/60)),IF(Parameter!$F$29=1,J42,IF(T42=\"\",0,J42)))","v":0},null,null,null,null,null,null,null,null,{"$f":"IF(I42>J42,I42-J42,0)","v":0},{"$f":"IF(C42<=TODAY(),IF(I42<J42,J42-I42,0),0)","v":0},null,null,null,null,null,null,null,null,null,null,null,null,null,{"$f":"IF(AF42<>\"\",IF(E42<>\"\",ABS(24*60*(E42-AF42)),ABS(24*60*(G42-AF42))),0)","v":0},{"$f":"COUNTA(AF42,AI42,AK42,AM42)","v":0},null,{"$f":"IF(AI42<>\"\",IF(H42<>\"\",ABS(24*60*(H42-AI42)),ABS(24*60*(F42-AI42))),0)","v":0},null,{"$f":"IF(AK42<>\"\",IF(E42<>\"\",ABS(24*60*(E42-AK42)),ABS(24*60*(G42-AK42))),0)","v":0},null,{"$f":"IF(AM42<>\"\",IF(H42<>\"\",ABS(24*60*(H42-AM42)),ABS(24*60*(F42-AM42))),0)","v":0},null,null,{"$f":"AQ41+R42-S42","v":0}]
[null,null,{"$f":"IF(MONTH(C14)<>2,IF(MONTH(C42+1)>MONTH(C42),\"\",C42+1),\"\")","v":"2020-11-30"},"2020-11-30",null,null,null,null,{"$f":"IF(LEN(F43)+LEN(H43)>0,IF(LEN(H43)>0,(HOUR(F43-E43)+MINUTE(F43-E43)/60)+(HOUR(H43-G43)+MINUTE(H43-G43)/60),(HOUR(F43-E43)+MINUTE(F43-E43)/60)),IF(Parameter!$F$29=1,J43,IF(T43=\"\",0,J43)))","v":0},null,null,null,null,null,null,null,null,{"$f":"IF(I43>J43,I43-J43,0)","v":0},{"$f":"IF(C43<=TODAY(),IF(I43<J43,J43-I43,0),0)","v":0},null,null,null,null,null,null,null,null,null,null,null,null,null,{"$f":"IF(AF43<>\"\",IF(E43<>\"\",ABS(24*60*(E43-AF43)),ABS(24*60*(G43-AF43))),0)","v":0},{"$f":"COUNTA(AF43,AI43,AK43,AM43)","v":0},null,{"$f":"IF(AI43<>\"\",IF(H43<>\"\",ABS(24*60*(H43-AI43)),ABS(24*60*(F43-AI43))),0)","v":0},null,{"$f":"IF(AK43<>\"\",IF(E43<>\"\",ABS(24*60*(E43-AK43)),ABS(24*60*(G43-AK43))),0)","v":0},null,{"$f":"IF(AM43<>\"\",IF(H43<>\"\",ABS(24*60*(H43-AM43)),ABS(24*60*(F43-AM43))),0)","v":0},null,null,{"$f":"AQ42+R43-S43","v":0}]
[null,null,{"$f":"IF(MONTH(C14)<>2,IF(MONTH(C43+1)>MONTH(C43),\"\",C43+1),\"\")","v":""},"",null,null,null,null,{"$f":"IF(LEN(F44)+LEN(H44)>0,IF(LEN(H44)>0,(HOUR(F44-E44)+MINUTE(F44-E44)/60)+(HOUR(H44-G44)+MINUTE(H44-G44)/60),(HOUR(F44-E44)+MINUTE(F44-E44)/60)),IF(Parameter!$F$29=1,J44,IF(T44=\"\",0,J44)))","v":0},null,null,null,null,null,null,null,null,{"$f":"IF(I44>J44,I44-J44,0)","v":0},{"$f":"IF(C44<=TODAY(),IF(I44<J44,J44-I44,0),0)","v":0},null,null,null,null,null,null,null,null,null,null,null,null,null,{"$f":"IF(AF44<>\"\",IF(E44<>\"\",ABS(24*60*(E44-AF44)),ABS(24*60*(G44-AF44))),0)","v":0},{"$f":"COUNTA(AF44,AI44,AK44,AM44)","v":0},null,{"$f":"IF(AI44<>\"\",IF(H44<>\"\",ABS(24*60*(H44-AI44)),ABS(24*60*(F44-AI44))),0)","v":0},null,{"$f":"IF(AK44<>\"\",IF(E44<>\"\",ABS(24*60*(E44-AK44)),ABS(24*60*(G44-AK44))),0)","v":0},null,{"$f":"IF(AM44<>\"\",IF(H44<>\"\",ABS(24*60*(H44-AM44)),ABS(24*60*(F44-AM44))),0)","v":0},null,null,{"$f":"AQ43+R44-S44","v":0}]
[null,null,null,null,null,null,null,"Summe:",{"$f":"ROUND(SUM(I14:I44),2)","v":0},{"$f":"ROUND(SUM(J13:J44),2)","v":0},{"$f":"SUM(K14:K44)","v":0},0,0,0,0,0,0,{"$f":"ROUND(SUM(R14:R44),2)","v":0},{"$f":"ROUND(SUM(S14:S44),2)","v":0},{"$f":"IF(COUNTA(T14:T44)=0,\"\",\"/U:\" & COUNTIF(T14:T44,\"u\")&\"/K:\" & COUNTIF(T14:T44,\"k\")&\"/Rest:\" & COUNTA(T14:T44)-COUNTIF(T14:T44,\"u\")-COUNTIF(T14:T44,\"k\"))","v":""},null,null,"Kontrollsummen:",null,null,null,null,null,null,null,null,null,null,null,null,null,null,null,null,null,null,null,null,{"$f":"SUM(AR14:AR44)","v":0},0,0,0,null,0,0,null,"Durchschnitt"]
[null,null,null,null,null,null,null,null,null,null,null,null,null,null,null,null,null,{"$f":"ROUND(R45-S45,2)","v":0},null,"Monatssaldo",null,null,{"$f":"\"IST-Stunden \"&ISTsumme&\" - SOLL-Stunden \"&SOLLsumme&\" =\"","v":"IST-Stunden 0 - SOLL-Stunden 0 ="},null,null,{"$f":"ISTsumme-SOLLsumme","v":0},null,null,null,null,null,null,null,null,null,null,null,null,null,null,null,null,null,null,null,null,null,null,null,null,null,{"$f":"IFERROR(SUM(AZ14:AZ44)/COUNTA(AZ14:AZ44),\"\")","v":""}]
[null,null,"Über-/Mehrstunden",null,null,{"$f":"ROUND(AT45+AU45,2)","v":0},"korr.Endsaldo inkl.Vorperiode:",null,null,null,null,null,null,null,null,null,null,{"$f":"ROUND(R9+R46,2)+F48","v":0},null,"Endsaldo inkl.Vorperiode",null,null,{"$f":"IF(M45<>0,\"minus automatische Überstunden:\",\"Monatssaldo (Zelle R46):\")","v":"Monatssaldo (Zelle R46):"},null,null,{"$f":"IF(M45<>0,-M45,R46)","v":0}]
[null,null,"Zeitsaldo Korrektur",null,null,{"$f":"ROUND((AS45-AT45),2)","v":0},null,null,null,null,null,null,null,null,null,null,null,null,null,"Auszahlung Gutstunden",null,null,{"$f":"IF(M45<>0,\"=Monatssaldo (Zelle R46):\",\"Differenz =\")","v":"Differenz ="},null,null,{"$f":"IF(M45<>0,(Z46+Z47),ROUND(Z46-Z47,1))","v":0}]
[null,null,"Info Lohn: ",null,null,null,null,null,null,null,null,null,null,null,null,null,null,{"$f":"R47-R48","v":0},null,"Vortrag abzgl.Auszahlg.",null,null,{"$f":"IF(M45<>0,\"Differenz =\",\"\")","v":""},null,null,{"$f":"IF(M45<>0,ROUND(Z48-R46,1),\"\")","v":""}]

{"sheet":"12 DEZ","index":14,"n_rows":49,"n_cols":75,"rows_kept":49,"cut":false,"hidden":false,"merged":[[2,30,2,32],[2,34,2,35],[2,37,2,38],[11,34,11,35],[11,37,11,38],[10,51,12,51],[46,2,46,4],[47,2,47,4],[47,6,47,9],[10,49,12,49],[47,14,47,16],[47,17,47,18],[46,17,46,18],[45,17,45,18],[10,14,12,14],[10,11,12,11],[10,43,12,43],[44,19,44,20],[10,42,12,42],[46,6,46,16],[47,10,47,13],[10,2,11,2],[11,4,11,5],[7,16,8,16],[10,10,12,10],[7,12,8,12],[7,14,8,14],[7,15,8,15],[10,50,12,50],[10,44,12,44],[10,45,12,45],[10,46,12,46],[10,47,12,47],[10,48,12,48],[0,22,0,26],[2,2,2,18],[45,8,45,9],[10,19,12,19],[10,3,11,3],[8,17,8,18],[10,20,12,20],[5,5,5,8],[6,26,7,26],[8,2,8,3],[8,4,8,8],[11,6,11,7],[45,22,45,24],[5,10,5,13],[7,10,8,10],[7,13,8,13],[5,27,6,27],[8,26,9,26],[10,22,10,26],[11,23,11,24],[11,25,11,26],[5,22,5,24],[11,22,12,22],[48,22,48,24],[46,22,46,24],[45,19,45,21],[46,19,46,21],[47,19,47,21],[48,19,48,21],[47,22,47,24],[5,16,6,16],[48,2,48,3],[48,4,48,9],[5,17,7,18],[10,12,12,12],[10,13,12,13],[10,15,12,15],[10,16,12,16],[48,17,48,18],[7,4,7,8],[5,2,5,4],[7,2,7,3],[11,17,11,18],[10,8,11,9],[10,4,10,7],[7,11,8,11],[2,74,11,74],[2,69,11,69],[2,70,11,70],[2,71,11,71],[2,72,11,72],[2,73,11,73]]}
[]
[]
[null,null,null,null,null,null,null,null,null,null,null,null,null,null,null,null,null,null,null,null,null,null,null,null,null,null,null,null,null,null,null,null,null,null,null,null,null,null,null,null,null,null,null,null,null,null,null,null,null,null,null,null,null,null,null,null,null,null,null,null,null,null,null,null,null,null,null,null,null,{"$f":"IF(AND(Parameter!B69<>\"\"),Parameter!B69&\" \"&Parameter!E69&\"%\",\"\")","v":"Zuschlag vor DP-Beginn 25%"},{"$f":"IF(AND(Parameter!E70<>\"\",Parameter!F70<>\"\"),Parameter!B70&\" \"&TEXT(Parameter!F70,\"hh:mm\")&\" \"&Parameter!E70&\"%\",\"\")","v":"Zuschlag innerhalb DP \nnach 1.Uhrzeit 19:30 50%"},{"$f":"Parameter!B71&\" \"&TEXT(Parameter!F71,\"hh:mm\")&\" \"&Parameter!E71&\"%\"","v":"Zuschlag innerhalb DP \nnach 2.Uhrzeit 21:00 75%"},{"$f":"Parameter!B72&\" \"&TEXT(Parameter!F72,\"hh:mm\")&\" \"&Parameter!E72&\"%\"","v":"Zuschlag außerhalb DP \nnach 1.Uhrzeit 19:30 100%"},{"$f":"Parameter!B73&\" \"&TEXT(Parameter!F73,\"hh:mm\")&\" \"&Parameter!E73&\"%\"","v":"Zuschlag außerhalb DP \nnach 2.Uhrzeit 21:00 125%"},{"$f":"IF(AND(Parameter!B74<>\"\"),Parameter!B74&\" \"&Parameter!E74&\"%\",\"\")","v":"Zuschlag nach DP-Ende 150%"}]
[]
[]
[null,null,"Monat",null,null,{"$f":"MonatsErster+335","v":"2020-12-01"},null,null,null,null,"täglich",null,null,null,"So/Feier","Woche",{"$f":"IF(LEFT(Parameter!J62,1)=\"1\",\"Manuell\",\"Morgen Zeit\")","v":"Manuell"},"Vortrag\nVormonat"]
[]
[null,null,"MitarbeitNr.",null,{"$f":"IF('1 JAN'!E8<>\"\",'1 JAN'!E8,\"\")","v":""},null,null,null,null,null,{"$f":"Parameter!Q50","v":">21:00   100% Üh   "},{"$f":"Parameter!Q52","v":">19:30   50% Üh   "},{"$f":"Parameter!Q54","v":">9h                 50% Üh   "},{"$f":"Parameter!Q56","v":"> Soll-h bis 9 Std.                    50% Üh   "},{"$f":"Parameter!Q58","v":"So/Feiert 100% Üh   "},{"$f":"Parameter!Q60","v":">39h      100% Üh   "},{"$f":"Parameter!Q62","v":"manuell    50% Mh   "}]
[null,null,"Name:",null,{"$f":"IF('1 JAN'!E9<>\"\",'1 JAN'!E9,\"\")","v":""},null,null,null,null,null,null,null,null,null,null,null,null,{"$f":"IF(Parameter!F34=TRUE,'11 NOV'!R49:S49,0)","v":0}]
[null,null,null,{"$f":"IF(D16=\"Fr\",\"JA\",\"\")","v":""}]
[null,null,"Datum","Tag","tatsächliche Arbeitszeit",null,null,null," Gesamt\nStunden",null,{"$f":"MID(Parameter!F50,3,99)","v":"Grund-Stunde ZA - Zuschlag auszahlen"},{"$f":"MID(Parameter!F52,3,99)","v":"Grund-Stunde ZA - Zuschlag auszahlen"},{"$f":"MID(Parameter!F54,3,99)","v":"Grund-Stunde ZA - Zuschlag auszahlen"},{"$f":"MID(Parameter!F56,3,99)","v":"Grund-Stunde ZA - Zuschlag auszahlen"},{"$f":"MID(Parameter!F58,3,99)","v":"Grund-Stunde ZA - Zuschlag auszahlen"},{"$f":"MID(Parameter!F60,3,99)","v":"Grund-Stunde ZA - Zuschlag auszahlen"},{"$f":"MID(Parameter!F62,3,99)","v":"Grund-Stunde ZA - Zuschlag auszahlen"},"Gut-","Minus-"," Urlaub\nKrank\n\nU oder K \nmachen","Feiertag\n\nF-ix\nB-ewegl.",null,{"$f":"IF(AND(UPPER(Parameter!G68=\"AKTIV\"),UPPER(Parameter!R69=\"AKTIV\")),\"Dienstplan-Vorschlag übernehmen\",IF(UPPER(Parameter!G68=\"AKTIV\"),\"Dienstplan\",\"Manuelle Zeiterfassung\"))","v":"Manuelle Zeiterfassung"},null,null,null,null,null,null,null,null,null,null,null,null,null,null,null,null,null,null,null,"Aktueller\nTages\nSaldo","Summe Grundstunden\nim Zeitsaldo","Summe \nZuschlag \nZeitsaldo \nerhöhend","Summe Grundstunden\nzur Auszahlung","Summe \nZuschlag\nzur Auszahlung","Korrigierter Tagessaldo","Korrigierte \nTages IST-Std","Differenz SOLL-Std zu IST-Std inkl. Zeitsaldo Korrekturen","Tagesstunden + sonntags Summe Wochen-\nStunden","Wochen\nsumme \n(korrigiert)"]
[null,null,null,null,"Vormittag",null,"Nachmittag",null,null,null,null,null,null,null,null,null,null,"Stunden",null,null,null,null,{"$f":"IF(UPPER(Parameter!G68)=\"AKTIV\",\"Manuelle Zeiten in Spalte W sind monatlich manuell in die Spalten E-H zu übernehmen\",\"Begründung manuelle Zeiterfassung\")","v":"Begründung manuelle Zeiterfassung"},"Vormittag",null,"Nachmittag"]
[null,"OK",null,null,"von","bis","von","bis","Ist","Soll",null,null,null,null,null,null,null,"+","-",null,null,null,null,"von","bis","von","bis",null,null,null,"Anmerkung","Internet AN Vorm.","Differenz","Anzahl Internetzeiten","Internet AB Vorm","Differenz","Internet AN Nachm.","Differenz","Internet AB Nachm.","Differenz",null,null,null,null,null,null,null,null,null,null,null,null,null,null,null,null,null,null,null,null,null,null,null,null,null,null,null,null,null,{"$f":"SUM(BR14:BR44)","v":0},0,0,0,0,0]
[null,null,{"$f":"DATE('1 JAN'!G2,12,1)","v":"2020-12-01"},{"$f":"C14","v":"2020-12-01"},null,null,null,null,{"$f":"IF(LEN(F14)+LEN(H14)>0,IF(LEN(H14)>0,(HOUR(F14-E14)+MINUTE(F14-E14)/60)+(HOUR(H14-G14)+MINUTE(H14-G14)/60),(HOUR(F14-E14)+MINUTE(F14-E14)/60)),IF(Parameter!$F$29=1,J14,IF(T14=\"\",0,J14)))","v":0},null,null,null,null,null,null,null,null,{"$f":"IF(I14>J14,I14-J14,0)","v":0},{"$f":"IF(C14<=TODAY(),IF(I14<J14,J14-I14,0),0)","v":0},null,null,null,null,null,null,null,null,null,null,null,null,null,{"$f":"IF(AF14<>\"\",IF(E14<>\"\",ABS(24*60*(E14-AF14)),ABS(24*60*(G14-AF14))),0)","v":0},{"$f":"COUNTA(AF14,AI14,AK14,AM14)","v":0},null,{"$f":"IF(AI14<>\"\",IF(H14<>\"\",ABS(24*60*(H14-AI14)),ABS(24*60*(F14-AI14))),0)","v":0},null,{"$f":"IF(AK14<>\"\",IF(E14<>\"\",ABS(24*60*(E14-AK14)),ABS(24*60*(G14-AK14))),0)","v":0},null,{"$f":"IF(AM14<>\"\",IF(H14<>\"\",ABS(24*60*(H14-AM14)),ABS(24*60*(F14-AM14))),0)","v":0},null,null,{"$f":"R9+R14-S14","v":0}]
[null,null,{"$f":"IF(MONTH(C14+1)>MONTH(C14),\"\",C14+1)","v":"2020-12-02"},"2020-12-02",null,null,null,null,{"$f":"IF(LEN(F15)+LEN(H15)>0,IF(LEN(H15)>0,(HOUR(F15-E15)+MINUTE(F15-E15)/60)+(HOUR(H15-G15)+MINUTE(H15-G15)/60),(HOUR(F15-E15)+MINUTE(F15-E15)/60)),IF(Parameter!$F$29=1,J15,IF(T15=\"\",0,J15)))","v":0},null,null,null,null,null,null,null,null,{"$f":"IF(I15>J15,I15-J15,0)","v":0},{"$f":"IF(C15<=TODAY(),IF(I15<J15,J15-I15,0),0)","v":0},null,null,null,null,null,null,null,null,null,null,null,null,null,{"$f":"IF(AF15<>\"\",IF(E15<>\"\",ABS(24*60*(E15-AF15)),ABS(24*60*(G15-AF15))),0)","v":0},{"$f":"COUNTA(AF15,AI15,AK15,AM15)","v":0},null,{"$f":"IF(AI15<>\"\",IF(H15<>\"\",ABS(24*60*(H15-AI15)),ABS(24*60*(F15-AI15))),0)","v":0},null,{"$f":"IF(AK15<>\"\",IF(E15<>\"\",ABS(24*60*(E15-AK15)),ABS(24*60*(G15-AK15))),0)","v":0},null,{"$f":"IF(AM15<>\"\",IF(H15<>\"\",ABS(24*60*(H15-AM15)),ABS(24*60*(F15-AM15))),0)","v":0},null,null,{"$f":"AQ14+R15-S15","v":0}]
[null,null,"2020-12-03","2020-12-03",null,null,null,null,{"$f":"IF(LEN(F16)+LEN(H16)>0,IF(LEN(H16)>0,(HOUR(F16-E16)+MINUTE(F16-E16)/60)+(HOUR(H16-G16)+MINUTE(H16-G16)/60),(HOUR(F16-E16)+MINUTE(F16-E16)/60)),IF(Parameter!$F$29=1,J16,IF(T16=\"\",0,J16)))","v":0},null,null,null,null,null,null,null,null,{"$f":"IF(I16>J16,I16-J16,0)","v":0},{"$f":"IF(C16<=TODAY(),IF(I16<J16,J16-I16,0),0)","v":0},null,null,null,null,null,null,null,null,null,null,null,null,null,{"$f":"IF(AF16<>\"\",IF(E16<>\"\",ABS(24*60*(E16-AF16)),ABS(24*60*(G16-AF16))),0)","v":0},{"$f":"COUNTA(AF16,AI16,AK16,AM16)","v":0},null,{"$f":"IF(AI16<>\"\",IF(H16<>\"\",ABS(24*60*(H16-AI16)),ABS(24*60*(F16-AI16))),0)","v":0},null,{"$f":"IF(AK16<>\"\",IF(E16<>\"\",ABS(24*60*(E16-AK16)),ABS(24*60*(G16-AK16))),0)","v":0},null,{"$f":"IF(AM16<>\"\",IF(H16<>\"\",ABS(24*60*(H16-AM16)),ABS(24*60*(F16-AM16))),0)","v":0},null,null,{"$f":"AQ15+R16-S16","v":0}]
[null,null,"2020-12-04","2020-12-04",null,null,null,null,{"$f":"IF(LEN(F17)+LEN(H17)>0,IF(LEN(H17)>0,(HOUR(F17-E17)+MINUTE(F17-E17)/60)+(HOUR(H17-G17)+MINUTE(H17-G17)/60),(HOUR(F17-E17)+MINUTE(F17-E17)/60)),IF(Parameter!$F$29=1,J17,IF(T17=\"\",0,J17)))","v":0},null,null,null,null,null,null,null,null,{"$f":"IF(I17>J17,I17-J17,0)","v":0},{"$f":"IF(C17<=TODAY(),IF(I17<J17,J17-I17,0),0)","v":0},null,null,null,null,null,null,null,null,null,null,null,null,null,{"$f":"IF(AF17<>\"\",IF(E17<>\"\",ABS(24*60*(E17-AF17)),ABS(24*60*(G17-AF17))),0)","v":0},{"$f":"COUNTA(AF17,AI17,AK17,AM17)","v":0},null,{"$f":"IF(AI17<>\"\",IF(H17<>\"\",ABS(24*60*(H17-AI17)),ABS(24*60*(F17-AI17))),0)","v":0},null,{"$f":"IF(AK17<>\"\",IF(E17<>\"\",ABS(24*60*(E17-AK17)),ABS(24*60*(G17-AK17))),0)","v":0},null,{"$f":"IF(AM17<>\"\",IF(H17<>\"\",ABS(24*60*(H17-AM17)),ABS(24*60*(F17-AM17))),0)","v":0},null,null,{"$f":"AQ16+R17-S17","v":0}]
[null,null,"2020-12-05","2020-12-05",null,null,null,null,{"$f":"IF(LEN(F18)+LEN(H18)>0,IF(LEN(H18)>0,(HOUR(F18-E18)+MINUTE(F18-E18)/60)+(HOUR(H18-G18)+MINUTE(H18-G18)/60),(HOUR(F18-E18)+MINUTE(F18-E18)/60)),IF(Parameter!$F$29=1,J18,IF(T18=\"\",0,J18)))","v":0},null,null,null,null,null,null,null,null,{"$f":"IF(I18>J18,I18-J18,0)","v":0},{"$f":"IF(C18<=TODAY(),IF(I18<J18,J18-I18,0),0)","v":0},null,null,null,null,null,null,null,null,null,null,null,null,null,{"$f":"IF(AF18<>\"\",IF(E18<>\"\",ABS(24*60*(E18-AF18)),ABS(24*60*(G18-AF18))),0)","v":0},{"$f":"COUNTA(AF18,AI18,AK18,AM18)","v":0},null,{"$f":"IF(AI18<>\"\",IF(H18<>\"\",ABS(24*60*(H18-AI18)),ABS(24*60*(F18-AI18))),0)","v":0},null,{"$f":"IF(AK18<>\"\",IF(E18<>\"\",ABS(24*60*(E18-AK18)),ABS(24*60*(G18-AK18))),0)","v":0},null,{"$f":"IF(AM18<>\"\",IF(H18<>\"\",ABS(24*60*(H18-AM18)),ABS(24*60*(F18-AM18))),0)","v":0},null,null,{"$f":"AQ17+R18-S18","v":0}]
[null,null,"2020-12-06","2020-12-06",null,null,null,null,{"$f":"IF(LEN(F19)+LEN(H19)>0,IF(LEN(H19)>0,(HOUR(F19-E19)+MINUTE(F19-E19)/60)+(HOUR(H19-G19)+MINUTE(H19-G19)/60),(HOUR(F19-E19)+MINUTE(F19-E19)/60)),IF(Parameter!$F$29=1,J19,IF(T19=\"\",0,J19)))","v":0},null,null,null,null,null,null,null,null,{"$f":"IF(I19>J19,I19-J19,0)","v":0},{"$f":"IF(C19<=TODAY(),IF(I19<J19,J19-I19,0),0)","v":0},null,null,null,null,null,null,null,null,null,null,null,null,null,{"$f":"IF(AF19<>\"\",IF(E19<>\"\",ABS(24*60*(E19-AF19)),ABS(24*60*(G19-AF19))),0)","v":0},{"$f":"COUNTA(AF19,AI19,AK19,AM19)","v":0},null,{"$f":"IF(AI19<>\"\",IF(H19<>\"\",ABS(24*60*(H19-AI19)),ABS(24*60*(F19-AI19))),0)","v":0},null,{"$f":"IF(AK19<>\"\",IF(E19<>\"\",ABS(24*60*(E19-AK19)),ABS(24*60*(G19-AK19))),0)","v":0},null,{"$f":"IF(AM19<>\"\",IF(H19<>\"\",ABS(24*60*(H19-AM19)),ABS(24*60*(F19-AM19))),0)","v":0},null,null,{"$f":"AQ18+R19-S19","v":0}]
[null,null,"2020-12-07","2020-12-07",null,null,null,null,{"$f":"IF(LEN(F20)+LEN(H20)>0,IF(LEN(H20)>0,(HOUR(F20-E20)+MINUTE(F20-E20)/60)+(HOUR(H20-G20)+MINUTE(H20-G20)/60),(HOUR(F20-E20)+MINUTE(F20-E20)/60)),IF(Parameter!$F$29=1,J20,IF(T20=\"\",0,J20)))","v":0},null,null,null,null,null,null,null,null,{"$f":"IF(I20>J20,I20-J20,0)","v":0},{"$f":"IF(C20<=TODAY(),IF(I20<J20,J20-I20,0),0)","v":0},null,null,null,null,null,null,null,null,null,null,null,null,null,{"$f":"IF(AF20<>\"\",IF(E20<>\"\",ABS(24*60*(E20-AF20)),ABS(24*60*(G20-AF20))),0)","v":0},{"$f":"COUNTA(AF20,AI20,AK20,AM20)","v":0},null,{"$f":"IF(AI20<>\"\",IF(H20<>\"\",ABS(24*60*(H20-AI20)),ABS(24*60*(F20-AI20))),0)","v":0},null,{"$f":"IF(AK20<>\"\",IF(E20<>\"\",ABS(24*60*(E20-AK20)),ABS(24*60*(G20-AK20))),0)","v":0},null,{"$f":"IF(AM20<>\"\",IF(H20<>\"\",ABS(24*60*(H20-AM20)),ABS(24*60*(F20-AM20))),0)","v":0},null,null,{"$f":"AQ19+R20-S20","v":0}]
[null,null,"2020-12-08","2020-12-08",null,null,null,null,{"$f":"IF(LEN(F21)+LEN(H21)>0,IF(LEN(H21)>0,(HOUR(F21-E21)+MINUTE(F21-E21)/60)+(HOUR(H21-G21)+MINUTE(H21-G21)/60),(HOUR(F21-E21)+MINUTE(F21-E21)/60)),IF(Parameter!$F$29=1,J21,IF(T21=\"\",0,J21)))","v":0},null,null,null,null,null,null,null,null,{"$f":"IF(I21>J21,I21-J21,0)","v":0},{"$f":"IF(C21<=TODAY(),IF(I21<J21,J21-I21,0),0)","v":0},null,"F",null,null,null,null,null,null,null,null,null,null,null,{"$f":"IF(AF21<>\"\",IF(E21<>\"\",ABS(24*60*(E21-AF21)),ABS(24*60*(G21-AF21))),0)","v":0},{"$f":"COUNTA(AF21,AI21,AK21,AM21)","v":0},null,{"$f":"IF(AI21<>\"\",IF(H21<>\"\",ABS(24*60*(H21-AI21)),ABS(24*60*(F21-AI21))),0)","v":0},null,{"$f":"IF(AK21<>\"\",IF(E21<>\"\",ABS(24*60*(E21-AK21)),ABS(24*60*(G21-AK21))),0)","v":0},null,{"$f":"IF(AM21<>\"\",IF(H21<>\"\",ABS(24*60*(H21-AM21)),ABS(24*60*(F21-AM21))),0)","v":0},null,null,{"$f":"AQ20+R21-S21","v":0}]
[null,null,"2020-12-09","2020-12-09",null,null,null,null,{"$f":"IF(LEN(F22)+LEN(H22)>0,IF(LEN(H22)>0,(HOUR(F22-E22)+MINUTE(F22-E22)/60)+(HOUR(H22-G22)+MINUTE(H22-G22)/60),(HOUR(F22-E22)+MINUTE(F22-E22)/60)),IF(Parameter!$F$29=1,J22,IF(T22=\"\",0,J22)))","v":0},null,null,null,null,null,null,null,null,{"$f":"IF(I22>J22,I22-J22,0)","v":0},{"$f":"IF(C22<=TODAY(),IF(I22<J22,J22-I22,0),0)","v":0},null,null,null,null,null,null,null,null,null,null,null,null,null,{"$f":"IF(AF22<>\"\",IF(E22<>\"\",ABS(24*60*(E22-AF22)),ABS(24*60*(G22-AF22))),0)","v":0},{"$f":"COUNTA(AF22,AI22,AK22,AM22)","v":0},null,{"$f":"IF(AI22<>\"\",IF(H22<>\"\",ABS(24*60*(H22-AI22)),ABS(24*60*(F22-AI22))),0)","v":0},null,{"$f":"IF(AK22<>\"\",IF(E22<>\"\",ABS(24*60*(E22-AK22)),ABS(24*60*(G22-AK22))),0)","v":0},null,{"$f":"IF(AM22<>\"\",IF(H22<>\"\",ABS(24*60*(H22-AM22)),ABS(24*60*(F22-AM22))),0)","v":0},null,null,{"$f":"AQ21+R22-S22","v":0}]
[null,null,"2020-12-10","2020-12-10",null,null,null,null,{"$f":"IF(LEN(F23)+LEN(H23)>0,IF(LEN(H23)>0,(HOUR(F23-E23)+MINUTE(F23-E23)/60)+(HOUR(H23-G23)+MINUTE(H23-G23)/60),(HOUR(F23-E23)+MINUTE(F23-E23)/60)),IF(Parameter!$F$29=1,J23,IF(T23=\"\",0,J23)))","v":0},null,null,null,null,null,null,null,null,{"$f":"IF(I23>J23,I23-J23,0)","v":0},{"$f":"IF(C23<=TODAY(),IF(I23<J23,J23-I23,0),0)","v":0},null,null,null,null,null,null,null,null,null,null,null,null,null,{"$f":"IF(AF23<>\"\",IF(E23<>\"\",ABS(24*60*(E23-AF23)),ABS(24*60*(G23-AF23))),0)","v":0},{"$f":"COUNTA(AF23,AI23,AK23,AM23)","v":0},null,{"$f":"IF(AI23<>\"\",IF(H23<>\"\",ABS(24*60*(H23-AI23)),ABS(24*60*(F23-AI23))),0)","v":0},null,{"$f":"IF(AK23<>\"\",IF(E23<>\"\",ABS(24*60*(E23-AK23)),ABS(24*60*(G23-AK23))),0)","v":0},null,{"$f":"IF(AM23<>\"\",IF(H23<>\"\",ABS(24*60*(H23-AM23)),ABS(24*60*(F23-AM23))),0)","v":0},null,null,{"$f":"AQ22+R23-S23","v":0}]
[null,null,"2020-12-11","2020-12-11",null,null,null,null,{"$f":"IF(LEN(F24)+LEN(H24)>0,IF(LEN(H24)>0,(HOUR(F24-E24)+MINUTE(F24-E24)/60)+(HOUR(H24-G24)+MINUTE(H24-G24)/60),(HOUR(F24-E24)+MINUTE(F24-E24)/60)),IF(Parameter!$F$29=1,J24,IF(T24=\"\",0,J24)))","v":0},null,null,null,null,null,null,null,null,{"$f":"IF(I24>J24,I24-J24,0)","v":0},{"$f":"IF(C24<=TODAY(),IF(I24<J24,J24-I24,0),0)","v":0},null,null,null,null,null,null,null,null,null,null,null,null,null,{"$f":"IF(AF24<>\"\",IF(E24<>\"\",ABS(24*60*(E24-AF24)),ABS(24*60*(G24-AF24))),0)","v":0},{"$f":"COUNTA(AF24,AI24,AK24,AM24)","v":0},null,{"$f":"IF(AI24<>\"\",IF(H24<>\"\",ABS(24*60*(H24-AI24)),ABS(24*60*(F24-AI24))),0)","v":0},null,{"$f":"IF(AK24<>\"\",IF(E24<>\"\",ABS(24*60*(E24-AK24)),ABS(24*60*(G24-AK24))),0)","v":0},null,{"$f":"IF(AM24<>\"\",IF(H24<>\"\",ABS(24*60*(H24-AM24)),ABS(24*60*(F24-AM24))),0)","v":0},null,null,{"$f":"AQ23+R24-S24","v":0}]
[null,null,"2020-12-12","2020-12-12",null,null,null,null,{"$f":"IF(LEN(F25)+LEN(H25)>0,IF(LEN(H25)>0,(HOUR(F25-E25)+MINUTE(F25-E25)/60)+(HOUR(H25-G25)+MINUTE(H25-G25)/60),(HOUR(F25-E25)+MINUTE(F25-E25)/60)),IF(Parameter!$F$29=1,J25,IF(T25=\"\",0,J25)))","v":0},null,null,null,null,null,null,null,null,{"$f":"IF(I25>J25,I25-J25,0)","v":0},{"$f":"IF(C25<=TODAY(),IF(I25<J25,J25-I25,0),0)","v":0},null,null,null,null,null,null,null,null,null,null,null,null,null,{"$f":"IF(AF25<>\"\",IF(E25<>\"\",ABS(24*60*(E25-AF25)),ABS(24*60*(G25-AF25))),0)","v":0},{"$f":"COUNTA(AF25,AI25,AK25,AM25)","v":0},null,{"$f":"IF(AI25<>\"\",IF(H25<>\"\",ABS(24*60*(H25-AI25)),ABS(24*60*(F25-AI25))),0)","v":0},null,{"$f":"IF(AK25<>\"\",IF(E25<>\"\",ABS(24*60*(E25-AK25)),ABS(24*60*(G25-AK25))),0)","v":0},null,{"$f":"IF(AM25<>\"\",IF(H25<>\"\",ABS(24*60*(H25-AM25)),ABS(24*60*(F25-AM25))),0)","v":0},null,null,{"$f":"AQ24+R25-S25","v":0}]
[null,null,"2020-12-13","2020-12-13",null,null,null,null,{"$f":"IF(LEN(F26)+LEN(H26)>0,IF(LEN(H26)>0,(HOUR(F26-E26)+MINUTE(F26-E26)/60)+(HOUR(H26-G26)+MINUTE(H26-G26)/60),(HOUR(F26-E26)+MINUTE(F26-E26)/60)),IF(Parameter!$F$29=1,J26,IF(T26=\"\",0,J26)))","v":0},null,null,null,null,null,null,null,null,{"$f":"IF(I26>J26,I26-J26,0)","v":0},{"$f":"IF(C26<=TODAY(),IF(I26<J26,J26-I26,0),0)","v":0},null,null,null,null,null,null,null,null,null,null,null,null,null,{"$f":"IF(AF26<>\"\",IF(E26<>\"\",ABS(24*60*(E26-AF26)),ABS(24*60*(G26-AF26))),0)","v":0},{"$f":"COUNTA(AF26,AI26,AK26,AM26)","v":0},null,{"$f":"IF(AI26<>\"\",IF(H26<>\"\",ABS(24*60*(H26-AI26)),ABS(24*60*(F26-AI26))),0)","v":0},null,{"$f":"IF(AK26<>\"\",IF(E26<>\"\",ABS(24*60*(E26-AK26)),ABS(24*60*(G26-AK26))),0)","v":0},null,{"$f":"IF(AM26<>\"\",IF(H26<>\"\",ABS(24*60*(H26-AM26)),ABS(24*60*(F26-AM26))),0)","v":0},null,null,{"$f":"AQ25+R26-S26","v":0}]
[null,null,"2020-12-14","2020-12-14",null,null,null,null,{"$f":"IF(LEN(F27)+LEN(H27)>0,IF(LEN(H27)>0,(HOUR(F27-E27)+MINUTE(F27-E27)/60)+(HOUR(H27-G27)+MINUTE(H27-G27)/60),(HOUR(F27-E27)+MINUTE(F27-E27)/60)),IF(Parameter!$F$29=1,J27,IF(T27=\"\",0,J27)))","v":0},null,null,null,null,null,null,null,null,{"$f":"IF(I27>J27,I27-J27,0)","v":0},{"$f":"IF(C27<=TODAY(),IF(I27<J27,J27-I27,0),0)","v":0},null,null,null,null,null,null,null,null,null,null,null,null,null,{"$f":"IF(AF27<>\"\",IF(E27<>\"\",ABS(24*60*(E27-AF27)),ABS(24*60*(G27-AF27))),0)","v":0},{"$f":"COUNTA(AF27,AI27,AK27,AM27)","v":0},null,{"$f":"IF(AI27<>\"\",IF(H27<>\"\",ABS(24*60*(H27-AI27)),ABS(24*60*(F27-AI27))),0)","v":0},null,{"$f":"IF(AK27<>\"\",IF(E27<>\"\",ABS(24*60*(E27-AK27)),ABS(24*60*(G27-AK27))),0)","v":0},null,{"$f":"IF(AM27<>\"\",IF(H27<>\"\",ABS(24*60*(H27-AM27)),ABS(24*60*(F27-AM27))),0)","v":0},null,null,{"$f":"AQ26+R27-S27","v":0}]
[null,null,"2020-12-15","2020-12-15",null,null,null,null,{"$f":"IF(LEN(F28)+LEN(H28)>0,IF(LEN(H28)>0,(HOUR(F28-E28)+MINUTE(F28-E28)/60)+(HOUR(H28-G28)+MINUTE(H28-G28)/60),(HOUR(F28-E28)+MINUTE(F28-E28)/60)),IF(Parameter!$F$29=1,J28,IF(T28=\"\",0,J28)))","v":0},null,null,null,null,null,null,null,null,{"$f":"IF(I28>J28,I28-J28,0)","v":0},{"$f":"IF(C28<=TODAY(),IF(I28<J28,J28-I28,0),0)","v":0},null,null,null,null,null,null,null,null,null,null,null,null,null,{"$f":"IF(AF28<>\"\",IF(E28<>\"\",ABS(24*60*(E28-AF28)),ABS(24*60*(G28-AF28))),0)","v":0},{"$f":"COUNTA(AF28,AI28,AK28,AM28)","v":0},null,{"$f":"IF(AI28<>\"\",IF(H28<>\"\",ABS(24*60*(H28-AI28)),ABS(24*60*(F28-AI28))),0)","v":0},null,{"$f":"IF(AK28<>\"\",IF(E28<>\"\",ABS(24*60*(E28-AK28)),ABS(24*60*(G28-AK28))),0)","v":0},null,{"$f":"IF(AM28<>\"\",IF(H28<>\"\",ABS(24*60*(H28-AM28)),ABS(24*60*(F28-AM28))),0)","v":0},null,null,{"$f":"AQ27+R28-S28","v":0}]
[null,null,"2020-12-16","2020-12-16",null,null,null,null,{"$f":"IF(LEN(F29)+LEN(H29)>0,IF(LEN(H29)>0,(HOUR(F29-E29)+MINUTE(F29-E29)/60)+(HOUR(H29-G29)+MINUTE(H29-G29)/60),(HOUR(F29-E29)+MINUTE(F29-E29)/60)),IF(Parameter!$F$29=1,J29,IF(T29=\"\",0,J29)))","v":0},null,null,null,null,null,null,null,null,{"$f":"IF(I29>J29,I29-J29,0)","v":0},{"$f":"IF(C29<=TODAY(),IF(I29<J29,J29-I29,0),0)","v":0},null,null,null,null,null,null,null,null,null,null,null,null,null,{"$f":"IF(AF29<>\"\",IF(E29<>\"\",ABS(24*60*(E29-AF29)),ABS(24*60*(G29-AF29))),0)","v":0},{"$f":"COUNTA(AF29,AI29,AK29,AM29)","v":0},null,{"$f":"IF(AI29<>\"\",IF(H29<>\"\",ABS(24*60*(H29-AI29)),ABS(24*60*(F29-AI29))),0)","v":0},null,{"$f":"IF(AK29<>\"\",IF(E29<>\"\",ABS(24*60*(E29-AK29)),ABS(24*60*(G29-AK29))),0)","v":0},null,{"$f":"IF(AM29<>\"\",IF(H29<>\"\",ABS(24*60*(H29-AM29)),ABS(24*60*(F29-AM29))),0)","v":0},null,null,{"$f":"AQ28+R29-S29","v":0}]
[null,null,"2020-12-17","2020-12-17",null,null,null,null,{"$f":"IF(LEN(F30)+LEN(H30)>0,IF(LEN(H30)>0,(HOUR(F30-E30)+MINUTE(F30-E30)/60)+(HOUR(H30-G30)+MINUTE(H30-G30)/60),(HOUR(F30-E30)+MINUTE(F30-E30)/60)),IF(Parameter!$F$29=1,J30,IF(T30=\"\",0,J30)))","v":0},null,null,null,null,null,null,null,null,{"$f":"IF(I30>J30,I30-J30,0)","v":0},{"$f":"IF(C30<=TODAY(),IF(I30<J30,J30-I30,0),0)","v":0},null,null,null,null,null,null,null,null,null,null,null,null,null,{"$f":"IF(AF30<>\"\",IF(E30<>\"\",ABS(24*60*(E30-AF30)),ABS(24*60*(G30-AF30))),0)","v":0},{"$f":"COUNTA(AF30,AI30,AK30,AM30)","v":0},null,{"$f":"IF(AI30<>\"\",IF(H30<>\"\",ABS(24*60*(H30-AI30)),ABS(24*60*(F30-AI30))),0)","v":0},null,{"$f":"IF(AK30<>\"\",IF(E30<>\"\",ABS(24*60*(E30-AK30)),ABS(24*60*(G30-AK30))),0)","v":0},null,{"$f":"IF(AM30<>\"\",IF(H30<>\"\",ABS(24*60*(H30-AM30)),ABS(24*60*(F30-AM30))),0)","v":0},null,null,{"$f":"AQ29+R30-S30","v":0}]
[null,null,"2020-12-18","2020-12-18",null,null,null,null,{"$f":"IF(LEN(F31)+LEN(H31)>0,IF(LEN(H31)>0,(HOUR(F31-E31)+MINUTE(F31-E31)/60)+(HOUR(H31-G31)+MINUTE(H31-G31)/60),(HOUR(F31-E31)+MINUTE(F31-E31)/60)),IF(Parameter!$F$29=1,J31,IF(T31=\"\",0,J31)))","v":0},null,null,null,null,null,null,null,null,{"$f":"IF(I31>J31,I31-J31,0)","v":0},{"$f":"IF(C31<=TODAY(),IF(I31<J31,J31-I31,0),0)","v":0},null,null,null,null,null,null,null,null,null,null,null,null,null,{"$f":"IF(AF31<>\"\",IF(E31<>\"\",ABS(24*60*(E31-AF31)),ABS(24*60*(G31-AF31))),0)","v":0},{"$f":"COUNTA(AF31,AI31,AK31,AM31)","v":0},null,{"$f":"IF(AI31<>\"\",IF(H31<>\"\",ABS(24*60*(H31-AI31)),ABS(24*60*(F31-AI31))),0)","v":0},null,{"$f":"IF(AK31<>\"\",IF(E31<>\"\",ABS(24*60*(E31-AK31)),ABS(24*60*(G31-AK31))),0)","v":0},null,{"$f":"IF(AM31<>\"\",IF(H31<>\"\",ABS(24*60*(H31-AM31)),ABS(24*60*(F31-AM31))),0)","v":0},null,null,{"$f":"AQ30+R31-S31","v":0}]
[null,null,"2020-12-19","2020-12-19",null,null,null,null,{"$f":"IF(LEN(F32)+LEN(H32)>0,IF(LEN(H32)>0,(HOUR(F32-E32)+MINUTE(F32-E32)/60)+(HOUR(H32-G32)+MINUTE(H32-G32)/60),(HOUR(F32-E32)+MINUTE(F32-E32)/60)),IF(Parameter!$F$29=1,J32,IF(T32=\"\",0,J32)))","v":0},null,null,null,null,null,null,null,null,{"$f":"IF(I32>J32,I32-J32,0)","v":0},{"$f":"IF(C32<=TODAY(),IF(I32<J32,J32-I32,0),0)","v":0},null,null,null,null,null,null,null,null,null,null,null,null,null,{"$f":"IF(AF32<>\"\",IF(E32<>\"\",ABS(24*60*(E32-AF32)),ABS(24*60*(G32-AF32))),0)","v":0},{"$f":"COUNTA(AF32,AI32,AK32,AM32)","v":0},null,{"$f":"IF(AI32<>\"\",IF(H32<>\"\",ABS(24*60*(H32-AI32)),ABS(24*60*(F32-AI32))),0)","v":0},null,{"$f":"IF(AK32<>\"\",IF(E32<>\"\",ABS(24*60*(E32-AK32)),ABS(24*60*(G32-AK32))),0)","v":0},null,{"$f":"IF(AM32<>\"\",IF(H32<>\"\",ABS(24*60*(H32-AM32)),ABS(24*60*(F32-AM32))),0)","v":0},null,null,{"$f":"AQ31+R32-S32","v":0}]
[null,null,"2020-12-20","2020-12-20",null,null,null,null,{"$f":"IF(LEN(F33)+LEN(H33)>0,IF(LEN(H33)>0,(HOUR(F33-E33)+MINUTE(F33-E33)/60)+(HOUR(H33-G33)+MINUTE(H33-G33)/60),(HOUR(F33-E33)+MINUTE(F33-E33)/60)),IF(Parameter!$F$29=1,J33,IF(T33=\"\",0,J33)))","v":0},null,null,null,null,null,null,null,null,{"$f":"IF(I33>J33,I33-J33,0)","v":0},{"$f":"IF(C33<=TODAY(),IF(I33<J33,J33-I33,0),0)","v":0},null,null,null,null,null,null,null,null,null,null,null,null,null,{"$f":"IF(AF33<>\"\",IF(E33<>\"\",ABS(24*60*(E33-AF33)),ABS(24*60*(G33-AF33))),0)","v":0},{"$f":"COUNTA(AF33,AI33,AK33,AM33)","v":0},null,{"$f":"IF(AI33<>\"\",IF(H33<>\"\",ABS(24*60*(H33-AI33)),ABS(24*60*(F33-AI33))),0)","v":0},null,{"$f":"IF(AK33<>\"\",IF(E33<>\"\",ABS(24*60*(E33-AK33)),ABS(24*60*(G33-AK33))),0)","v":0},null,{"$f":"IF(AM33<>\"\",IF(H33<>\"\",ABS(24*60*(H33-AM33)),ABS(24*60*(F33-AM33))),0)","v":0},null,null,{"$f":"AQ32+R33-S33","v":0}]
[null,null,"2020-12-21","2020-12-21",null,null,null,null,{"$f":"IF(LEN(F34)+LEN(H34)>0,IF(LEN(H34)>0,(HOUR(F34-E34)+MINUTE(F34-E34)/60)+(HOUR(H34-G34)+MINUTE(H34-G34)/60),(HOUR(F34-E34)+MINUTE(F34-E34)/60)),IF(Parameter!$F$29=1,J34,IF(T34=\"\",0,J34)))","v":0},null,null,null,null,null,null,null,null,{"$f":"IF(I34>J34,I34-J34,0)","v":0},{"$f":"IF(C34<=TODAY(),IF(I34<J34,J34-I34,0),0)","v":0},null,null,null,null,null,null,null,null,null,null,null,null,null,{"$f":"IF(AF34<>\"\",IF(E34<>\"\",ABS(24*60*(E34-AF34)),ABS(24*60*(G34-AF34))),0)","v":0},{"$f":"COUNTA(AF34,AI34,AK34,AM34)","v":0},null,{"$f":"IF(AI34<>\"\",IF(H34<>\"\",ABS(24*60*(H34-AI34)),ABS(24*60*(F34-AI34))),0)","v":0},null,{"$f":"IF(AK34<>\"\",IF(E34<>\"\",ABS(24*60*(E34-AK34)),ABS(24*60*(G34-AK34))),0)","v":0},null,{"$f":"IF(AM34<>\"\",IF(H34<>\"\",ABS(24*60*(H34-AM34)),ABS(24*60*(F34-AM34))),0)","v":0},null,null,{"$f":"AQ33+R34-S34","v":0}]
[null,null,"2020-12-22","2020-12-22",null,null,null,null,{"$f":"IF(LEN(F35)+LEN(H35)>0,IF(LEN(H35)>0,(HOUR(F35-E35)+MINUTE(F35-E35)/60)+(HOUR(H35-G35)+MINUTE(H35-G35)/60),(HOUR(F35-E35)+MINUTE(F35-E35)/60)),IF(Parameter!$F$29=1,J35,IF(T35=\"\",0,J35)))","v":0},null,null,null,null,null,null,null,null,{"$f":"IF(I35>J35,I35-J35,0)","v":0},{"$f":"IF(C35<=TODAY(),IF(I35<J35,J35-I35,0),0)","v":0},null,null,null,null,null,null,null,null,null,null,null,null,null,{"$f":"IF(AF35<>\"\",IF(E35<>\"\",ABS(24*60*(E35-AF35)),ABS(24*60*(G35-AF35))),0)","v":0},{"$f":"COUNTA(AF35,AI35,AK35,AM35)","v":0},null,{"$f":"IF(AI35<>\"\",IF(H35<>\"\",ABS(24*60*(H35-AI35)),ABS(24*60*(F35-AI35))),0)","v":0},null,{"$f":"IF(AK35<>\"\",IF(E35<>\"\",ABS(24*60*(E35-AK35)),ABS(24*60*(G35-AK35))),0)","v":0},null,{"$f":"IF(AM35<>\"\",IF(H35<>\"\",ABS(24*60*(H35-AM35)),ABS(24*60*(F35-AM35))),0)","v":0},null,null,{"$f":"AQ34+R35-S35","v":0}]
[null,null,"2020-12-23","2020-12-23",null,null,null,null,{"$f":"IF(LEN(F36)+LEN(H36)>0,IF(LEN(H36)>0,(HOUR(F36-E36)+MINUTE(F36-E36)/60)+(HOUR(H36-G36)+MINUTE(H36-G36)/60),(HOUR(F36-E36)+MINUTE(F36-E36)/60)),IF(Parameter!$F$29=1,J36,IF(T36=\"\",0,J36)))","v":0},null,null,null,null,null,null,null,null,{"$f":"IF(I36>J36,I36-J36,0)","v":0},{"$f":"IF(C36<=TODAY(),IF(I36<J36,J36-I36,0),0)","v":0},null,null,null,null,null,null,null,null,null,null,null,null,null,{"$f":"IF(AF36<>\"\",IF(E36<>\"\",ABS(24*60*(E36-AF36)),ABS(24*60*(G36-AF36))),0)","v":0},{"$f":"COUNTA(AF36,AI36,AK36,AM36)","v":0},null,{"$f":"IF(AI36<>\"\",IF(H36<>\"\",ABS(24*60*(H36-AI36)),ABS(24*60*(F36-AI36))),0)","v":0},null,{"$f":"IF(AK36<>\"\",IF(E36<>\"\",ABS(24*60*(E36-AK36)),ABS(24*60*(G36-AK36))),0)","v":0},null,{"$f":"IF(AM36<>\"\",IF(H36<>\"\",ABS(24*60*(H36-AM36)),ABS(24*60*(F36-AM36))),0)","v":0},null,null,{"$f":"AQ35+R36-S36","v":0}]
[null,null,"2020-12-24","2020-12-24",null,null,null,null,{"$f":"IF(LEN(F37)+LEN(H37)>0,IF(LEN(H37)>0,(HOUR(F37-E37)+MINUTE(F37-E37)/60)+(HOUR(H37-G37)+MINUTE(H37-G37)/60),(HOUR(F37-E37)+MINUTE(F37-E37)/60)),IF(Parameter!$F$29=1,J37,IF(T37=\"\",0,J37)))","v":0},null,null,null,null,null,null,null,null,{"$f":"IF(I37>J37,I37-J37,0)","v":0},{"$f":"IF(C37<=TODAY(),IF(I37<J37,J37-I37,0),0)","v":0},null,"F",null,null,null,null,null,null,null,null,null,null,null,{"$f":"IF(AF37<>\"\",IF(E37<>\"\",ABS(24*60*(E37-AF37)),ABS(24*60*(G37-AF37))),0)","v":0},{"$f":"COUNTA(AF37,AI37,AK37,AM37)","v":0},null,{"$f":"IF(AI37<>\"\",IF(H37<>\"\",ABS(24*60*(H37-AI37)),ABS(24*60*(F37-AI37))),0)","v":0},null,{"$f":"IF(AK37<>\"\",IF(E37<>\"\",ABS(24*60*(E37-AK37)),ABS(24*60*(G37-AK37))),0)","v":0},null,{"$f":"IF(AM37<>\"\",IF(H37<>\"\",ABS(24*60*(H37-AM37)),ABS(24*60*(F37-AM37))),0)","v":0},null,null,{"$f":"AQ36+R37-S37","v":0}]
[null,null,"2020-12-25","2020-12-25",null,null,null,null,{"$f":"IF(LEN(F38)+LEN(H38)>0,IF(LEN(H38)>0,(HOUR(F38-E38)+MINUTE(F38-E38)/60)+(HOUR(H38-G38)+MINUTE(H38-G38)/60),(HOUR(F38-E38)+MINUTE(F38-E38)/60)),IF(Parameter!$F$29=1,J38,IF(T38=\"\",0,J38)))","v":0},null,null,null,null,null,null,null,null,{"$f":"IF(I38>J38,I38-J38,0)","v":0},{"$f":"IF(C38<=TODAY(),IF(I38<J38,J38-I38,0),0)","v":0},null,"F",null,null,null,null,null,null,null,null,null,null,null,{"$f":"IF(AF38<>\"\",IF(E38<>\"\",ABS(24*60*(E38-AF38)),ABS(24*60*(G38-AF38))),0)","v":0},{"$f":"COUNTA(AF38,AI38,AK38,AM38)","v":0},null,{"$f":"IF(AI38<>\"\",IF(H38<>\"\",ABS(24*60*(H38-AI38)),ABS(24*60*(F38-AI38))),0)","v":0},null,{"$f":"IF(AK38<>\"\",IF(E38<>\"\",ABS(24*60*(E38-AK38)),ABS(24*60*(G38-AK38))),0)","v":0},null,{"$f":"IF(AM38<>\"\",IF(H38<>\"\",ABS(24*60*(H38-AM38)),ABS(24*60*(F38-AM38))),0)","v":0},null,null,{"$f":"AQ37+R38-S38","v":0}]
[null,null,"2020-12-26","2020-12-26",null,null,null,null,{"$f":"IF(LEN(F39)+LEN(H39)>0,IF(LEN(H39)>0,(HOUR(F39-E39)+MINUTE(F39-E39)/60)+(HOUR(H39-G39)+MINUTE(H39-G39)/60),(HOUR(F39-E39)+MINUTE(F39-E39)/60)),IF(Parameter!$F$29=1,J39,IF(T39=\"\",0,J39)))","v":0},null,null,null,null,null,null,null,null,{"$f":"IF(I39>J39,I39-J39,0)","v":0},{"$f":"IF(C39<=TODAY(),IF(I39<J39,J39-I39,0),0)","v":0},null,"F",null,null,null,null,null,null,null,null,null,null,null,{"$f":"IF(AF39<>\"\",IF(E39<>\"\",ABS(24*60*(E39-AF39)),ABS(24*60*(G39-AF39))),0)","v":0},{"$f":"COUNTA(AF39,AI39,AK39,AM39)","v":0},null,{"$f":"IF(AI39<>\"\",IF(H39<>\"\",ABS(24*60*(H39-AI39)),ABS(24*60*(F39-AI39))),0)","v":0},null,{"$f":"IF(AK39<>\"\",IF(E39<>\"\",ABS(24*60*(E39-AK39)),ABS(24*60*(G39-AK39))),0)","v":0},null,{"$f":"IF(AM39<>\"\",IF(H39<>\"\",ABS(24*60*(H39-AM39)),ABS(24*60*(F39-AM39))),0)","v":0},null,null,{"$f":"AQ38+R39-S39","v":0}]
[null,null,"2020-12-27","2020-12-27",null,null,null,null,{"$f":"IF(LEN(F40)+LEN(H40)>0,IF(LEN(H40)>0,(HOUR(F40-E40)+MINUTE(F40-E40)/60)+(HOUR(H40-G40)+MINUTE(H40-G40)/60),(HOUR(F40-E40)+MINUTE(F40-E40)/60)),IF(Parameter!$F$29=1,J40,IF(T40=\"\",0,J40)))","v":0},null,null,null,null,null,null,null,null,{"$f":"IF(I40>J40,I40-J40,0)","v":0},{"$f":"IF(C40<=TODAY(),IF(I40<J40,J40-I40,0),0)","v":0},null,null,null,null,null,null,null,null,null,null,null,null,null,{"$f":"IF(AF40<>\"\",IF(E40<>\"\",ABS(24*60*(E40-AF40)),ABS(24*60*(G40-AF40))),0)","v":0},{"$f":"COUNTA(AF40,AI40,AK40,AM40)","v":0},null,{"$f":"IF(AI40<>\"\",IF(H40<>\"\",ABS(24*60*(H40-AI40)),ABS(24*60*(F40-AI40))),0)","v":0},null,{"$f":"IF(AK40<>\"\",IF(E40<>\"\",ABS(24*60*(E40-AK40)),ABS(24*60*(G40-AK40))),0)","v":0},null,{"$f":"IF(AM40<>\"\",IF(H40<>\"\",ABS(24*60*(H40-AM40)),ABS(24*60*(F40-AM40))),0)","v":0},null,null,{"$f":"AQ39+R40-S40","v":0}]
[null,null,"2020-12-28","2020-12-28",null,null,null,null,{"$f":"IF(LEN(F41)+LEN(H41)>0,IF(LEN(H41)>0,(HOUR(F41-E41)+MINUTE(F41-E41)/60)+(HOUR(H41-G41)+MINUTE(H41-G41)/60),(HOUR(F41-E41)+MINUTE(F41-E41)/60)),IF(Parameter!$F$29=1,J41,IF(T41=\"\",0,J41)))","v":0},null,null,null,null,null,null,null,null,{"$f":"IF(I41>J41,I41-J41,0)","v":0},{"$f":"IF(C41<=TODAY(),IF(I41<J41,J41-I41,0),0)","v":0},null,null,null,null,null,null,null,null,null,null,null,null,null,{"$f":"IF(AF41<>\"\",IF(E41<>\"\",ABS(24*60*(E41-AF41)),ABS(24*60*(G41-AF41))),0)","v":0},{"$f":"COUNTA(AF41,AI41,AK41,AM41)","v":0},null,{"$f":"IF(AI41<>\"\",IF(H41<>\"\",ABS(24*60*(H41-AI41)),ABS(24*60*(F41-AI41))),0)","v":0},null,{"$f":"IF(AK41<>\"\",IF(E41<>\"\",ABS(24*60*(E41-AK41)),ABS(24*60*(G41-AK41))),0)","v":0},null,{"$f":"IF(AM41<>\"\",IF(H41<>\"\",ABS(24*60*(H41-AM41)),ABS(24*60*(F41-AM41))),0)","v":0},null,null,{"$f":"AQ40+R41-S41","v":0}]
[null,null,"2020-12-29","2020-12-29",null,null,null,null,{"$f":"IF(LEN(F42)+LEN(H42)>0,IF(LEN(H42)>0,(HOUR(F42-E42)+MINUTE(F42-E42)/60)+(HOUR(H42-G42)+MINUTE(H42-G42)/60),(HOUR(F42-E42)+MINUTE(F42-E42)/60)),IF(Parameter!$F$29=1,J42,IF(T42=\"\",0,J42)))","v":0},null,null,null,null,null,null,null,null,{"$f":"IF(I42>J42,I42-J42,0)","v":0},{"$f":"IF(C42<=TODAY(),IF(I42<J42,J42-I42,0),0)","v":0},null,null,null,null,null,null,null,null,null,null,null,null,null,{"$f":"IF(AF42<>\"\",IF(E42<>\"\",ABS(24*60*(E42-AF42)),ABS(24*60*(G42-AF42))),0)","v":0},{"$f":"COUNTA(AF42,AI42,AK42,AM42)","v":0},null,{"$f":"IF(AI42<>\"\",IF(H42<>\"\",ABS(24*60*(H42-AI42)),ABS(24*60*(F42-AI42))),0)","v":0},null,{"$f":"IF(AK42<>\"\",IF(E42<>\"\",ABS(24*60*(E42-AK42)),ABS(24*60*(G42-AK42))),0)","v":0},null,{"$f":"IF(AM42<>\"\",IF(H42<>\"\",ABS(24*60*(H42-AM42)),ABS(24*60*(F42-AM42))),0)","v":0},null,null,{"$f":"AQ41+R42-S42","v":0}]
[null,null,{"$f":"IF(MONTH(C14)<>2,IF(MONTH(C42+1)>MONTH(C42),\"\",C42+1),\"\")","v":"2020-12-30"},"2020-12-30",null,null,null,null,{"$f":"IF(LEN(F43)+LEN(H43)>0,IF(LEN(H43)>0,(HOUR(F43-E43)+MINUTE(F43-E43)/60)+(HOUR(H43-G43)+MINUTE(H43-G43)/60),(HOUR(F43-E43)+MINUTE(F43-E43)/60)),IF(Parameter!$F$29=1,J43,IF(T43=\"\",0,J43)))","v":0},null,null,null,null,null,null,null,null,{"$f":"IF(I43>J43,I43-J43,0)","v":0},{"$f":"IF(C43<=TODAY(),IF(I43<J43,J43-I43,0),0)","v":0},null,null,null,null,null,null,null,null,null,null,null,null,null,{"$f":"IF(AF43<>\"\",IF(E43<>\"\",ABS(24*60*(E43-AF43)),ABS(24*60*(G43-AF43))),0)","v":0},{"$f":"COUNTA(AF43,AI43,AK43,AM43)","v":0},null,{"$f":"IF(AI43<>\"\",IF(H43<>\"\",ABS(24*60*(H43-AI43)),ABS(24*60*(F43-AI43))),0)","v":0},null,{"$f":"IF(AK43<>\"\",IF(E43<>\"\",ABS(24*60*(E43-AK43)),ABS(24*60*(G43-AK43))),0)","v":0},null,{"$f":"IF(AM43<>\"\",IF(H43<>\"\",ABS(24*60*(H43-AM43)),ABS(24*60*(F43-AM43))),0)","v":0},null,null,{"$f":"AQ42+R43-S43","v":0}]
[null,null,{"$f":"IF(MONTH(C14)<>2,IF(MONTH(C43+1)>MONTH(C43),\"\",C43+1),\"\")","v":"2020-12-31"},"2020-12-31",null,null,null,null,{"$f":"IF(LEN(F44)+LEN(H44)>0,IF(LEN(H44)>0,(HOUR(F44-E44)+MINUTE(F44-E44)/60)+(HOUR(H44-G44)+MINUTE(H44-G44)/60),(HOUR(F44-E44)+MINUTE(F44-E44)/60)),IF(Parameter!$F$29=1,J44,IF(T44=\"\",0,J44)))","v":0},null,null,null,null,null,null,null,null,{"$f":"IF(I44>J44,I44-J44,0)","v":0},{"$f":"IF(C44<=TODAY(),IF(I44<J44,J44-I44,0),0)","v":0},null,"F",null,null,null,null,null,null,null,null,null,null,null,{"$f":"IF(AF44<>\"\",IF(E44<>\"\",ABS(24*60*(E44-AF44)),ABS(24*60*(G44-AF44))),0)","v":0},{"$f":"COUNTA(AF44,AI44,AK44,AM44)","v":0},null,{"$f":"IF(AI44<>\"\",IF(H44<>\"\",ABS(24*60*(H44-AI44)),ABS(24*60*(F44-AI44))),0)","v":0},null,{"$f":"IF(AK44<>\"\",IF(E44<>\"\",ABS(24*60*(E44-AK44)),ABS(24*60*(G44-AK44))),0)","v":0},null,{"$f":"IF(AM44<>\"\",IF(H44<>\"\",ABS(24*60*(H44-AM44)),ABS(24*60*(F44-AM44))),0)","v":0},null,null,{"$f":"AQ43+R44-S44","v":0}]
[null,null,null,null,null,null,null,"Summe:",{"$f":"ROUND(SUM(I14:I44),2)","v":0},{"$f":"ROUND(SUM(J13:J44),2)","v":0},{"$f":"SUM(K14:K44)","v":0},0,0,0,0,0,0,{"$f":"ROUND(SUM(R14:R44),2)","v":0},{"$f":"ROUND(SUM(S14:S44),2)","v":0},{"$f":"IF(COUNTA(T14:T44)=0,\"\",\"/U:\" & COUNTIF(T14:T44,\"u\")&\"/K:\" & COUNTIF(T14:T44,\"k\")&\"/Rest:\" & COUNTA(T14:T44)-COUNTIF(T14:T44,\"u\")-COUNTIF(T14:T44,\"k\"))","v":""},null,null,"Kontrollsummen:",null,null,null,null,null,null,null,null,null,null,null,null,null,null,null,null,null,null,null,null,{"$f":"SUM(AR14:AR44)","v":0},0,0,0,null,0,0,null,"Durchschnitt"]
[null,null,null,null,null,null,null,null,null,null,null,null,null,null,null,null,null,{"$f":"ROUND(R45-S45,2)","v":0},null,"Monatssaldo",null,null,{"$f":"\"IST-Stunden \"&ISTsumme&\" - SOLL-Stunden \"&SOLLsumme&\" =\"","v":"IST-Stunden 0 - SOLL-Stunden 0 ="},null,null,{"$f":"ISTsumme-SOLLsumme","v":0},null,null,null,null,null,null,null,null,null,null,null,null,null,null,null,null,null,null,null,null,null,null,null,null,null,{"$f":"IFERROR(SUM(AZ14:AZ44)/COUNTA(AZ14:AZ44),\"\")","v":""}]
[null,null,"Über-/Mehrstunden",null,null,{"$f":"ROUND(AT45+AU45,2)","v":0},"^^",null,null,null,null,null,null,null,null,null,null,{"$f":"ROUND(R9+R46,2)+F48","v":0},null,"Endsaldo inkl.Vorperiode",null,null,{"$f":"IF(M45<>0,\"minus automatische Überstunden:\",\"Monatssaldo (Zelle R46):\")","v":"Monatssaldo (Zelle R46):"},null,null,{"$f":"IF(M45<>0,-M45,R46)","v":0}]
[null,null,"Zeitsaldo Korrektur",null,null,{"$f":"ROUND((AS45-AT45),2)","v":0},null,null,null,null,null,null,null,null,null,null,null,null,null,"Auszahlung Gutstunden",null,null,{"$f":"IF(M45<>0,\"=Monatssaldo (Zelle R46):\",\"Differenz =\")","v":"Differenz ="},null,null,{"$f":"IF(M45<>0,(Z46+Z47),ROUND(Z46-Z47,1))","v":0}]
[null,null,"Info Lohn: ",null,null,null,null,null,null,null,null,null,null,null,null,null,null,{"$f":"R47-R48","v":0},null,"Vortrag abzgl.Auszahlg.",null,null,{"$f":"IF(M45<>0,\"Differenz =\",\"\")","v":""},null,null,{"$f":"IF(M45<>0,ROUND(Z48-R46,1),\"\")","v":""}]

{"sheet":"Fortbildung","index":15,"n_rows":17,"n_cols":5,"rows_kept":17,"cut":false,"hidden":false,"merged":[[0,2,2,3]]}
[null,null,{"$f":"\"Fortbildung \" &YEAR('1 JAN'!F6)","v":"Fortbildung 2020"}]
[]
[]
[null,null,"Einheiten","Sonstige Bemerkungen (Datum, Inhalt, …)",2]
[null,"Jänner"]
[null,"Februar"]
[null,"März"]
[null,"April"]
[null,"Mai"]
[null,"Juni"]
[null,"Juli"]
[null,"August"]
[null,"September"]
[null,"Oktober"]
[null,"November"]
[null,"Dezember"]
[null,"Summe",{"$f":"IF(E4=2,SUM(C5:C16) &\" h\",SUM(C5:C16) &\" Tage\")","v":"0 h"}]

{"sheet":"Summen","index":16,"n_rows":72,"n_cols":16,"rows_kept":72,"cut":false,"hidden":false,"merged":[[11,4,11,5],[15,4,15,7],[11,8,11,10],[11,6,11,7],[49,4,49,5],[49,6,49,12],[4,8,4,10],[5,5,5,10],[8,8,8,10],[9,8,9,10],[10,8,10,10],[4,4,4,5],[4,6,4,7],[8,4,8,5],[9,4,9,5],[8,6,8,7],[9,6,9,7],[10,6,10,7],[10,4,10,5],[7,4,7,10]]}
[]
[]
[]
[]
[null,null,null,null,{"$f":"'1 JAN'!F6","v":"2020-01-01"},null,"Mitarbeiter Nr.:",null,{"$f":"IF('1 JAN'!E8<>\"\",'1 JAN'!E8,\"\")","v":""}]
[null,null,null,null,"Name:",{"$f":"IF('1 JAN'!E9<>\"\",'1 JAN'!E9,\"\")","v":""}]
[]
[null,null,null,null,"Summe Abwesenheiten"]
[null,null,null,null,"Summe Urlaubstage U",null,"Summe Pflegeurlaubstage P",null,"Summe Krankenstandstage K"]
[null,null,null,null,{"$f":"COUNTIF('1 JAN'!$T:$T,\"U\")+COUNTIF('2 FEB'!$T:$T,\"U\")+COUNTIF('3 MAR'!$T:$T,\"U\")+COUNTIF('4 APR'!$T:$T,\"U\")+COUNTIF('5 MAI'!$T:$T,\"U\")+COUNTIF('6 JUN'!$T:$T,\"U\")+COUNTIF('7 JUL'!$T:$T,\"U\")+COUNTIF('8 AUG'!$T:$T,\"U\")+COUNTIF('9 SEP'!$T:$T,\"U\")+COUNTIF('10 OKT'!$T:$T,\"U\")+COUNTIF('11 NOV'!$T:$T,\"U\")+COUNTIF('12 DEZ'!$T:$T,\"U\")+K8","v":0},null,{"$f":"COUNTIF('1 JAN'!$T:$T,\"P\")+COUNTIF('2 FEB'!$T:$T,\"P\")+COUNTIF('3 MAR'!$T:$T,\"P\")+COUNTIF('4 APR'!$T:$T,\"P\")+COUNTIF('5 MAI'!$T:$T,\"P\")+COUNTIF('6 JUN'!$T:$T,\"P\")+COUNTIF('7 JUL'!$T:$T,\"P\")+COUNTIF('8 AUG'!$T:$T,\"P\")+COUNTIF('9 SEP'!$T:$T,\"P\")+COUNTIF('10 OKT'!$T:$T,\"P\")+COUNTIF('11 NOV'!$T:$T,\"P\")+COUNTIF('12 DEZ'!$T:$T,\"P\")","v":0},null,{"$f":"COUNTIF('1 JAN'!$T:$T,\"K\")+COUNTIF('2 FEB'!$T:$T,\"K\")+COUNTIF('3 MAR'!$T:$T,\"K\")+COUNTIF('4 APR'!$T:$T,\"K\")+COUNTIF('5 MAI'!$T:$T,\"K\")+COUNTIF('6 JUN'!$T:$T,\"K\")+COUNTIF('7 JUL'!$T:$T,\"K\")+COUNTIF('8 AUG'!$T:$T,\"K\")+COUNTIF('9 SEP'!$T:$T,\"K\")+COUNTIF('10 OKT'!$T:$T,\"K\")+COUNTIF('11 NOV'!$T:$T,\"K\")+COUNTIF('12 DEZ'!$T:$T,\"K\")","v":0}]
[null,null,null,null,"Summe Begräbnis B",null,"Summe Sonderurlaube S",null,"Summe Arzt und Amtswege A"]
[null,null,null,null,{"$f":"COUNTIF('1 JAN'!$T:$T,\"B\")+COUNTIF('2 FEB'!$T:$T,\"B\")+COUNTIF('3 MAR'!$T:$T,\"B\")+COUNTIF('4 APR'!$T:$T,\"B\")+COUNTIF('5 MAI'!$T:$T,\"B\")+COUNTIF('6 JUN'!$T:$T,\"B\")+COUNTIF('7 JUL'!$T:$T,\"B\")+COUNTIF('8 AUG'!$T:$T,\"B\")+COUNTIF('9 SEP'!$T:$T,\"B\")+COUNTIF('10 OKT'!$T:$T,\"B\")+COUNTIF('11 NOV'!$T:$T,\"B\")+COUNTIF('12 DEZ'!$T:$T,\"B\")","v":0},null,{"$f":"COUNTIF('1 JAN'!$T:$T,\"S\")+COUNTIF('2 FEB'!$T:$T,\"S\")+COUNTIF('3 MAR'!$T:$T,\"S\")+COUNTIF('4 APR'!$T:$T,\"S\")+COUNTIF('5 MAI'!$T:$T,\"S\")+COUNTIF('6 JUN'!$T:$T,\"S\")+COUNTIF('7 JUL'!$T:$T,\"S\")+COUNTIF('8 AUG'!$T:$T,\"S\")+COUNTIF('9 SEP'!$T:$T,\"S\")+COUNTIF('10 OKT'!$T:$T,\"S\")+COUNTIF('11 NOV'!$T:$T,\"S\")+COUNTIF('12 DEZ'!$T:$T,\"S\")","v":0},null,{"$f":"COUNTIF('1 JAN'!$T:$T,\"A\")+COUNTIF('2 FEB'!$T:$T,\"A\")+COUNTIF('3 MAR'!$T:$T,\"A\")+COUNTIF('4 APR'!$T:$T,\"A\")+COUNTIF('5 MAI'!$T:$T,\"A\")+COUNTIF('6 JUN'!$T:$T,\"A\")+COUNTIF('7 JUL'!$T:$T,\"A\")+COUNTIF('8 AUG'!$T:$T,\"A\")+COUNTIF('9 SEP'!$T:$T,\"A\")+COUNTIF('10 OKT'!$T:$T,\"A\")+COUNTIF('11 NOV'!$T:$T,\"A\")+COUNTIF('12 DEZ'!$T:$T,\"A\")","v":0}]
[]
[]
[]
[null,null,null,null,"Vortrag aus Vorjahr"]
[]
[null,null,null,null,null,"Ist-h","Soll-h","Differenz","Saldo","Auszahlung","Vortrag"]
[null,null,null,null,"JÄNNER",{"$f":"ISTsumme","v":0},{"$f":"SOLLsumme","v":0},{"$f":"F19-G19","v":0},{"$f":"I16+H19","v":0},{"$f":"'1 JAN'!R48","v":0},{"$f":"'1 JAN'!R49","v":0}]
[null,null,null,null,"FEBRUAR",{"$f":"'2 FEB'!ISTsumme","v":0},{"$f":"'2 FEB'!SOLLsumme","v":0},{"$f":"F20-G20","v":0},{"$f":"I19+H20","v":0},{"$f":"'2 FEB'!R48","v":0},{"$f":"'2 FEB'!R49","v":0}]
[null,null,null,null,"MÄRZ",{"$f":"'3 MAR'!ISTsumme","v":0},{"$f":"'3 MAR'!SOLLsumme","v":0},{"$f":"F21-G21","v":0},{"$f":"I20+H21","v":0},{"$f":"'3 MAR'!R48","v":0},{"$f":"'3 MAR'!R49","v":0}]
[null,null,null,null,"Gesamt",{"$f":"SUM(F19:F21)","v":0},{"$f":"SUM(G19:G21)","v":0},{"$f":"SUM(H19:H21)","v":0},{"$f":"I21","v":0},{"$f":"SUM(J19:J21)","v":0},{"$f":"K21","v":0}]
[]
[null,null,null,null,null,"Ist-h","Soll-h","Differenz","Saldo","Auszahlung","Vortrag"]
[null,null,null,null,"APRIL",{"$f":"'4 APR'!ISTsumme","v":0},{"$f":"'4 APR'!SOLLsumme","v":0},{"$f":"F25-G25","v":0},{"$f":"I22+H25","v":0},{"$f":"'4 APR'!R48","v":0},{"$f":"'4 APR'!R49","v":0}]
[null,null,null,null,"MAI",{"$f":"'5 MAI'!ISTsumme","v":0},{"$f":"'5 MAI'!SOLLsumme","v":0},{"$f":"F26-G26","v":0},{"$f":"I25+H26","v":0},{"$f":"'5 MAI'!R48","v":0},{"$f":"'5 MAI'!R49","v":0}]
[null,null,null,null,"JUNI",{"$f":"'6 JUN'!ISTsumme","v":0},{"$f":"'6 JUN'!SOLLsumme","v":0},{"$f":"F27-G27","v":0},{"$f":"I26+H27","v":0},{"$f":"'6 JUN'!R48","v":0},{"$f":"'6 JUN'!R49","v":0}]
[null,null,null,null,"Gesamt",{"$f":"SUM(F25:F27)","v":0},{"$f":"SUM(G25:G27)","v":0},{"$f":"SUM(H25:H27)","v":0},{"$f":"I27","v":0},{"$f":"SUM(J25:J27)","v":0},{"$f":"K27","v":0}]
[]
[null,null,null,null,null,"Ist-h","Soll-h","Differenz","Saldo","Auszahlung","Vortrag"]
[null,null,null,null,"JULI",{"$f":"'7 JUL'!ISTsumme","v":0},{"$f":"'7 JUL'!SOLLsumme","v":0},{"$f":"F31-G31","v":0},{"$f":"I28+H31","v":0},{"$f":"'7 JUL'!R48","v":0},{"$f":"'7 JUL'!R49","v":0}]
[null,null,null,null,"AUGUST",{"$f":"'8 AUG'!ISTsumme","v":0},{"$f":"'8 AUG'!SOLLsumme","v":0},{"$f":"F32-G32","v":0},{"$f":"I31+H32","v":0},{"$f":"'8 AUG'!R48","v":0},{"$f":"'8 AUG'!R49","v":0}]
[null,null,null,null,"SEPTEMBER",{"$f":"'9 SEP'!ISTsumme","v":0},{"$f":"'9 SEP'!SOLLsumme","v":0},{"$f":"F33-G33","v":0},{"$f":"I32+H33","v":0},{"$f":"'9 SEP'!R48","v":0},{"$f":"'9 SEP'!R49","v":0}]
[null,null,null,null,"Gesamt",{"$f":"SUM(F31:F33)","v":0},{"$f":"SUM(G31:G33)","v":0},{"$f":"SUM(H31:H33)","v":0},{"$f":"I33","v":0},{"$f":"SUM(J31:J33)","v":0},{"$f":"K33","v":0}]
[]
[null,null,null,null,null,"Ist-h","Soll-h","Differenz","Saldo","Auszahlung","Vortrag"]
[null,null,null,null,"OKTOBER",{"$f":"'10 OKT'!ISTsumme","v":0},{"$f":"'10 OKT'!SOLLsumme","v":0},{"$f":"F37-G37","v":0},{"$f":"I34+H37","v":0},{"$f":"'10 OKT'!R48","v":0},{"$f":"'10 OKT'!R49","v":0}]
[null,null,null,null,"NOVEMBER",{"$f":"'11 NOV'!ISTsumme","v":0},{"$f":"'11 NOV'!SOLLsumme","v":0},{"$f":"F38-G38","v":0},{"$f":"I37+H38","v":0},{"$f":"'11 NOV'!R48","v":0},{"$f":"'11 NOV'!R49","v":0}]
[null,null,null,null,"DEZEMBER",{"$f":"'12 DEZ'!ISTsumme","v":0},{"$f":"'12 DEZ'!SOLLsumme","v":0},{"$f":"F39-G39","v":0},{"$f":"I38+H39","v":0},{"$f":"'12 DEZ'!R48","v":0},{"$f":"'12 DEZ'!R49","v":0}]
[null,null,null,null,"Gesamt",{"$f":"SUM(F37:F39)","v":0},{"$f":"SUM(G37:G39)","v":0},{"$f":"SUM(H37:H39)","v":0},{"$f":"I39","v":0},{"$f":"SUM(J37:J39)","v":0},{"$f":"K39","v":0}]
[]
[null,null,null,null,null,"Ist-h","Soll-h","Differenz","Saldo","Auszahlung","Vortrag"]
[null,null,null,null,"GESAMT",{"$f":"F22+F28+F34+F40","v":0},{"$f":"G22+G28+G34+G40","v":0},{"$f":"H22+H28+H34+H40","v":0},{"$f":"I40","v":0},{"$f":"J22+J28+J34+J40","v":0},{"$f":"K40","v":0}]
[]
[]
[]
[]
[]
[]
[null,null,null,null,{"$f":"$E$5","v":"2020-01-01"},null,{"$f":"$F$6","v":""}]
[]
[]
[null,null,null,null,null,{"$f":"'1 JAN'!K8","v":">21:00   100% Üh   "},{"$f":"'1 JAN'!L8","v":">19:30   50% Üh   "},{"$f":"'1 JAN'!M8","v":">9h                 50% Üh   "},{"$f":"'1 JAN'!N8","v":"> Soll-h bis 9 Std.                    50% Üh   "},{"$f":"'1 JAN'!O8","v":"So/Feiert 100% Üh   "},{"$f":"'1 JAN'!P8","v":">39h      100% Üh   "},{"$f":"'1 JAN'!Q8","v":"manuell    50% Mh   "},"Ausbezahlt"]
[null,null,null,null,"JÄNNER",{"$f":"'1 JAN'!K45","v":0},{"$f":"'1 JAN'!L45","v":0},{"$f":"'1 JAN'!M45","v":0},{"$f":"'1 JAN'!N45","v":0},{"$f":"'1 JAN'!O45","v":0},{"$f":"'1 JAN'!P45","v":0},{"$f":"'1 JAN'!Q45","v":0},null,null,null,true]
[null,null,null,null,"FEBRUAR",{"$f":"'2 FEB'!K45","v":0},{"$f":"'2 FEB'!L45","v":0},{"$f":"'2 FEB'!M45","v":0},{"$f":"'2 FEB'!N45","v":0},{"$f":"'2 FEB'!O45","v":0},{"$f":"'2 FEB'!P45","v":0},{"$f":"'2 FEB'!Q45","v":0}]
[null,null,null,null,"MÄRZ",{"$f":"'3 MAR'!K45","v":0},{"$f":"'3 MAR'!L45","v":0},{"$f":"'3 MAR'!M45","v":0},{"$f":"'3 MAR'!N45","v":0},{"$f":"'3 MAR'!O45","v":0},{"$f":"'3 MAR'!P45","v":0},{"$f":"'3 MAR'!Q45","v":0}]
[]
[null,null,null,null,null,{"$f":"F$53","v":">21:00   100% Üh   "},{"$f":"G$53","v":">19:30   50% Üh   "},">9h                 50% Üh   ","> Soll-h bis 9 Std.                    50% Üh   ","So/Feiert 100% Üh   ",">39h      100% Üh   ","manuell    50% Mh   ","Ausbezahlt"]
[null,null,null,null,"APRIL",{"$f":"'4 APR'!K45","v":0},{"$f":"'4 APR'!L45","v":0},{"$f":"'4 APR'!M45","v":0},{"$f":"'4 APR'!N45","v":0},{"$f":"'4 APR'!O45","v":0},{"$f":"'4 APR'!P45","v":0},{"$f":"'4 APR'!Q45","v":0}]
[null,null,null,null,"MAI",{"$f":"'5 MAI'!K45","v":0},{"$f":"'5 MAI'!L45","v":0},{"$f":"'5 MAI'!M45","v":0},{"$f":"'5 MAI'!N45","v":0},{"$f":"'5 MAI'!O45","v":0},{"$f":"'5 MAI'!P45","v":0},{"$f":"'5 MAI'!Q45","v":0}]
[null,null,null,null,"JUNI",{"$f":"'6 JUN'!K45","v":0},{"$f":"'6 JUN'!L45","v":0},{"$f":"'6 JUN'!M45","v":0},{"$f":"'6 JUN'!N45","v":0},{"$f":"'6 JUN'!O45","v":0},{"$f":"'6 JUN'!P45","v":0},{"$f":"'6 JUN'!Q45","v":0}]
[]
[null,null,null,null,null,{"$f":"F$53","v":">21:00   100% Üh   "},{"$f":"G$53","v":">19:30   50% Üh   "},">9h                 50% Üh   ","> Soll-h bis 9 Std.                    50% Üh   ","So/Feiert 100% Üh   ",">39h      100% Üh   ","manuell    50% Mh   ","Ausbezahlt"]
[null,null,null,null,"JULI",{"$f":"'7 JUL'!K45","v":0},{"$f":"'7 JUL'!L45","v":0},{"$f":"'7 JUL'!M45","v":0},{"$f":"'7 JUL'!N45","v":0},{"$f":"'7 JUL'!O45","v":0},{"$f":"'7 JUL'!P45","v":0},{"$f":"'7 JUL'!Q45","v":0}]
[null,null,null,null,"AUGUST",{"$f":"'8 AUG'!K45","v":0},{"$f":"'8 AUG'!L45","v":0},{"$f":"'8 AUG'!M45","v":0},{"$f":"'8 AUG'!N45","v":0},{"$f":"'8 AUG'!O45","v":0},{"$f":"'8 AUG'!P45","v":0},{"$f":"'8 AUG'!Q45","v":0}]
[null,null,null,null,"SEPTEMBER",{"$f":"'9 SEP'!K45","v":0},{"$f":"'9 SEP'!L45","v":0},{"$f":"'9 SEP'!M45","v":0},{"$f":"'9 SEP'!N45","v":0},{"$f":"'9 SEP'!O45","v":0},{"$f":"'9 SEP'!P45","v":0},{"$f":"'9 SEP'!Q45","v":0}]
[]
[null,null,null,null,null,{"$f":"F$53","v":">21:00   100% Üh   "},{"$f":"G$53","v":">19:30   50% Üh   "},">9h                 50% Üh   ","> Soll-h bis 9 Std.                    50% Üh   ","So/Feiert 100% Üh   ",">39h      100% Üh   ","manuell    50% Mh   ","Ausbezahlt"]
[null,null,null,null,"OKTOBER",{"$f":"'10 OKT'!K45","v":0},{"$f":"'10 OKT'!L45","v":0},{"$f":"'10 OKT'!M45","v":0},{"$f":"'10 OKT'!N45","v":0},{"$f":"'10 OKT'!O45","v":0},{"$f":"'10 OKT'!P45","v":0},{"$f":"'10 OKT'!Q45","v":0}]
[null,null,null,null,"NOVEMBER",{"$f":"'11 NOV'!K45","v":0},{"$f":"'11 NOV'!L45","v":0},{"$f":"'11 NOV'!M45","v":0},{"$f":"'11 NOV'!N45","v":0},{"$f":"'11 NOV'!O45","v":0},{"$f":"'11 NOV'!P45","v":0},{"$f":"'11 NOV'!Q45","v":0}]
[null,null,null,null,"DEZEMBER",{"$f":"'12 DEZ'!K45","v":0},{"$f":"'12 DEZ'!L45","v":0},{"$f":"'12 DEZ'!M45","v":0},{"$f":"'12 DEZ'!N45","v":0},{"$f":"'12 DEZ'!O45","v":0},{"$f":"'12 DEZ'!P45","v":0},{"$f":"'12 DEZ'!Q45","v":0}]
[null,null,null,null,"Gesamt",{"$f":"F54+F55+F56+F59+F60+F61+F64+F65+F66+F69+F70+F71","v":0},{"$f":"G54+G55+G56+G59+G60+G61+G64+G65+G66+G69+G70+G71","v":0},0,0,0,0,0,0]